zookeeper-dev mailing list archives

Site index · List index
Message view « Date » · « Thread »
Top « Date » · « Thread »
From Apache Jenkins Server <jenk...@builds.apache.org>
Subject ZooKeeper-trunk - Build # 2806 - Still Failing
Date Sun, 01 Nov 2015 11:14:17 GMT
See https://builds.apache.org/job/ZooKeeper-trunk/2806/

###################################################################################
########################## LAST 60 LINES OF THE CONSOLE ###########################
[...truncated 385563 lines...]
    [junit] 2015-11-01 11:12:35,846 [myid:] - INFO  [main:FourLetterWordMain@84] - connecting
to 127.0.0.1 19436
    [junit] 2015-11-01 11:12:35,846 [myid:] - INFO  [main:QuorumUtil@243] - 127.0.0.1:19436
is no longer accepting client connections
    [junit] 2015-11-01 11:12:35,846 [myid:] - INFO  [main:FourLetterWordMain@84] - connecting
to 127.0.0.1 19439
    [junit] 2015-11-01 11:12:35,847 [myid:] - INFO  [main:QuorumUtil@243] - 127.0.0.1:19439
is no longer accepting client connections
    [junit] 2015-11-01 11:12:35,847 [myid:] - INFO  [main:FourLetterWordMain@84] - connecting
to 127.0.0.1 19442
    [junit] 2015-11-01 11:12:35,848 [myid:] - INFO  [main:QuorumUtil@243] - 127.0.0.1:19442
is no longer accepting client connections
    [junit] 2015-11-01 11:12:35,849 [myid:] - INFO  [main:ZKTestCase$1@65] - SUCCEEDED testRemoveOneAsynchronous
    [junit] 2015-11-01 11:12:35,849 [myid:] - INFO  [main:ZKTestCase$1@60] - FINISHED testRemoveOneAsynchronous
    [junit] Tests run: 11, Failures: 0, Errors: 0, Skipped: 0, Time elapsed: 129.939 sec,
Thread: 4, Class: org.apache.zookeeper.test.ReconfigTest
    [junit] 2015-11-01 11:12:36,043 [myid:] - INFO  [SessionTracker:SessionTrackerImpl@158]
- SessionTrackerImpl exited loop!
    [junit] 2015-11-01 11:14:13,764 [myid:] - INFO  [main:JUnit4ZKTestRunner$LoggedInvokeMethod@82]
- Memory used 22879
    [junit] 2015-11-01 11:14:13,765 [myid:] - INFO  [main:JUnit4ZKTestRunner$LoggedInvokeMethod@87]
- Number of threads 55
    [junit] 2015-11-01 11:14:13,765 [myid:] - INFO  [main:JUnit4ZKTestRunner$LoggedInvokeMethod@102]
- FINISHED TEST METHOD testManyChildWatchersAutoReset
    [junit] 2015-11-01 11:14:13,765 [myid:] - INFO  [main:ClientBase@537] - tearDown starting
    [junit] 2015-11-01 11:14:13,765 [myid:] - INFO  [ProcessThread(sid:0 cport:30076)::PrepRequestProcessor@649]
- Processed session termination for sessionid: 0x101614182990000
    [junit] 2015-11-01 11:14:13,773 [myid:] - INFO  [main:ZooKeeper@1110] - Session: 0x101614182990000
closed
    [junit] 2015-11-01 11:14:13,773 [myid:] - INFO  [main-EventThread:ClientCnxn$EventThread@542]
- EventThread shut down for session: 0x101614182990000
    [junit] 2015-11-01 11:14:13,773 [myid:] - INFO  [NIOWorkerThread-2:MBeanRegistry@128]
- Unregister MBean [org.apache.ZooKeeperService:name0=StandaloneServer_port30076,name1=Connections,name2=127.0.0.1,name3=0x101614182990000]
    [junit] 2015-11-01 11:14:13,774 [myid:] - INFO  [ProcessThread(sid:0 cport:30076)::PrepRequestProcessor@649]
- Processed session termination for sessionid: 0x101614182990001
    [junit] 2015-11-01 11:14:13,774 [myid:] - INFO  [NIOWorkerThread-2:NIOServerCnxn@606]
- Closed socket connection for client /127.0.0.1:55228 which had sessionid 0x101614182990000
    [junit] 2015-11-01 11:14:13,781 [myid:] - INFO  [main:ZooKeeper@1110] - Session: 0x101614182990001
closed
    [junit] 2015-11-01 11:14:13,781 [myid:] - INFO  [main:ClientBase@507] - STOPPING server
    [junit] 2015-11-01 11:14:13,781 [myid:] - INFO  [NIOWorkerThread-20:MBeanRegistry@128]
- Unregister MBean [org.apache.ZooKeeperService:name0=StandaloneServer_port30076,name1=Connections,name2=127.0.0.1,name3=0x101614182990001]
    [junit] 2015-11-01 11:14:13,781 [myid:] - INFO  [main-EventThread:ClientCnxn$EventThread@542]
- EventThread shut down for session: 0x101614182990001
    [junit] 2015-11-01 11:14:13,782 [myid:] - INFO  [ConnnectionExpirer:NIOServerCnxnFactory$ConnectionExpirerThread@583]
- ConnnectionExpirerThread interrupted
    [junit] 2015-11-01 11:14:13,783 [myid:] - INFO  [NIOWorkerThread-20:NIOServerCnxn@606]
- Closed socket connection for client /127.0.0.1:55231 which had sessionid 0x101614182990001
    [junit] 2015-11-01 11:14:13,784 [myid:] - INFO  [NIOServerCxnFactory.SelectorThread-1:NIOServerCnxnFactory$SelectorThread@420]
- selector thread exitted run method
    [junit] 2015-11-01 11:14:13,783 [myid:] - INFO  [NIOServerCxnFactory.AcceptThread:0.0.0.0/0.0.0.0:30076:NIOServerCnxnFactory$AcceptThread@219]
- accept thread exitted run method
    [junit] 2015-11-01 11:14:13,785 [myid:] - INFO  [NIOServerCxnFactory.SelectorThread-0:NIOServerCnxnFactory$SelectorThread@420]
- selector thread exitted run method
    [junit] 2015-11-01 11:14:13,785 [myid:] - INFO  [main:ZooKeeperServer@498] - shutting
down
    [junit] 2015-11-01 11:14:13,786 [myid:] - INFO  [main:SessionTrackerImpl@232] - Shutting
down
    [junit] 2015-11-01 11:14:13,786 [myid:] - INFO  [main:PrepRequestProcessor@967] - Shutting
down
    [junit] 2015-11-01 11:14:13,786 [myid:] - INFO  [main:SyncRequestProcessor@191] - Shutting
down
    [junit] 2015-11-01 11:14:13,786 [myid:] - INFO  [ProcessThread(sid:0 cport:30076)::PrepRequestProcessor@154]
- PrepRequestProcessor exited loop!
    [junit] 2015-11-01 11:14:13,786 [myid:] - INFO  [SyncThread:0:SyncRequestProcessor@169]
- SyncRequestProcessor exited!
    [junit] 2015-11-01 11:14:13,787 [myid:] - INFO  [main:FinalRequestProcessor@492] - shutdown
of request processor complete
    [junit] 2015-11-01 11:14:13,787 [myid:] - INFO  [main:MBeanRegistry@128] - Unregister
MBean [org.apache.ZooKeeperService:name0=StandaloneServer_port30076,name1=InMemoryDataTree]
    [junit] 2015-11-01 11:14:13,787 [myid:] - INFO  [main:MBeanRegistry@128] - Unregister
MBean [org.apache.ZooKeeperService:name0=StandaloneServer_port30076]
    [junit] 2015-11-01 11:14:13,788 [myid:] - INFO  [main:FourLetterWordMain@84] - connecting
to 127.0.0.1 30076
    [junit] 2015-11-01 11:14:13,789 [myid:] - INFO  [main:JMXEnv@142] - ensureOnly:[]
    [junit] 2015-11-01 11:14:13,795 [myid:] - INFO  [main:ClientBase@562] - fdcount after
test is: 50 at start it was 50
    [junit] 2015-11-01 11:14:13,795 [myid:] - INFO  [main:ZKTestCase$1@65] - SUCCEEDED testManyChildWatchersAutoReset
    [junit] 2015-11-01 11:14:13,795 [myid:] - INFO  [main:ZKTestCase$1@60] - FINISHED testManyChildWatchersAutoReset
    [junit] Tests run: 4, Failures: 0, Errors: 0, Skipped: 0, Time elapsed: 446.464 sec, Thread:
8, Class: org.apache.zookeeper.test.DisconnectedWatcherTest

BUILD FAILED
/home/jenkins/jenkins-slave/workspace/ZooKeeper-trunk/trunk/build.xml:1494: The following
error occurred while executing this line:
/home/jenkins/jenkins-slave/workspace/ZooKeeper-trunk/trunk/build.xml:1379: Tests failed!

Total time: 10 minutes 26 seconds
Build step 'Execute shell' marked build as failure
[FINDBUGS] Skipping publisher since build result is FAILURE
[WARNINGS] Skipping publisher since build result is FAILURE
Archiving artifacts
Recording fingerprints
Recording test results
Publishing Javadoc
Email was triggered for: Failure - Any
Sending email for trigger: Failure - Any



###################################################################################
############################## FAILED TESTS (if any) ##############################
1 tests failed.
FAILED:  org.apache.zookeeper.test.ClientPortBindTest.testBindByAddress

Error Message:
Forked Java VM exited abnormally. Please note the time in the report does not reflect the
time until the VM exit.

Stack Trace:
junit.framework.AssertionFailedError: Forked Java VM exited abnormally. Please note the time
in the report does not reflect the time until the VM exit.
	at java.lang.Thread.run(Thread.java:722)



Mime
  • Unnamed multipart/mixed (inline, None, 0 bytes)
View raw message