zookeeper-dev mailing list archives

Site index · List index
Message view « Date » · « Thread »
Top « Date » · « Thread »
From Apache Jenkins Server <jenk...@builds.apache.org>
Subject ZooKeeper_branch35_jdk7 - Build # 408 - Still Failing
Date Mon, 02 Nov 2015 03:48:47 GMT
See https://builds.apache.org/job/ZooKeeper_branch35_jdk7/408/

###################################################################################
########################## LAST 60 LINES OF THE CONSOLE ###########################
[...truncated 376637 lines...]
    [junit] 2015-11-02 03:44:03,913 [myid:] - WARN  [LearnerHandler-/127.0.0.1:47971:LearnerHandler@903]
- Ignoring unexpected exception
    [junit] java.lang.InterruptedException
    [junit] 	at java.util.concurrent.locks.AbstractQueuedSynchronizer.acquireInterruptibly(AbstractQueuedSynchronizer.java:1219)
    [junit] 	at java.util.concurrent.locks.ReentrantLock.lockInterruptibly(ReentrantLock.java:340)
    [junit] 	at java.util.concurrent.LinkedBlockingQueue.put(LinkedBlockingQueue.java:338)
    [junit] 	at org.apache.zookeeper.server.quorum.LearnerHandler.shutdown(LearnerHandler.java:901)
    [junit] 	at org.apache.zookeeper.server.quorum.LearnerHandler.run(LearnerHandler.java:622)
    [junit] 2015-11-02 03:44:03,915 [myid:] - INFO  [NIOServerCxnFactory.SelectorThread-0:NIOServerCnxnFactory$SelectorThread@420]
- selector thread exitted run method
    [junit] 2015-11-02 03:44:03,915 [myid:] - INFO  [NIOServerCxnFactory.SelectorThread-1:NIOServerCnxnFactory$SelectorThread@420]
- selector thread exitted run method
    [junit] 2015-11-02 03:44:03,915 [myid:] - INFO  [NIOServerCxnFactory.AcceptThread:0.0.0.0/0.0.0.0:30211:NIOServerCnxnFactory$AcceptThread@219]
- accept thread exitted run method
    [junit] 2015-11-02 03:44:03,916 [myid:] - INFO  [QuorumPeer[myid=5](plain=/0:0:0:0:0:0:0:0:30211)(secure=disabled):MBeanRegistry@128]
- Unregister MBean [org.apache.ZooKeeperService:name0=ReplicatedServer_id5,name1=replica.5,name2=Leader]
    [junit] 2015-11-02 03:44:03,916 [myid:] - WARN  [QuorumPeer[myid=5](plain=/0:0:0:0:0:0:0:0:30211)(secure=disabled):QuorumPeer@1111]
- Unexpected exception
    [junit] java.lang.InterruptedException
    [junit] 	at java.lang.Object.wait(Native Method)
    [junit] 	at org.apache.zookeeper.server.quorum.Leader.lead(Leader.java:559)
    [junit] 	at org.apache.zookeeper.server.quorum.QuorumPeer.run(QuorumPeer.java:1108)
    [junit] 2015-11-02 03:44:03,916 [myid:] - INFO  [QuorumPeer[myid=5](plain=/0:0:0:0:0:0:0:0:30211)(secure=disabled):Leader@613]
- Shutting down
    [junit] 2015-11-02 03:44:03,916 [myid:] - WARN  [QuorumPeer[myid=5](plain=/0:0:0:0:0:0:0:0:30211)(secure=disabled):QuorumPeer@1142]
- PeerState set to LOOKING
    [junit] 2015-11-02 03:44:03,916 [myid:] - WARN  [QuorumPeer[myid=5](plain=/0:0:0:0:0:0:0:0:30211)(secure=disabled):QuorumPeer@1124]
- QuorumPeer main thread exited
    [junit] 2015-11-02 03:44:03,916 [myid:] - INFO  [/127.0.0.1:30213:QuorumCnxManager$Listener@659]
- Leaving listener
    [junit] 2015-11-02 03:44:03,917 [myid:] - INFO  [QuorumPeer[myid=5](plain=/0:0:0:0:0:0:0:0:30211)(secure=disabled):MBeanRegistry@128]
- Unregister MBean [org.apache.ZooKeeperService:name0=ReplicatedServer_id5]
    [junit] 2015-11-02 03:44:03,917 [myid:] - INFO  [QuorumPeer[myid=5](plain=/0:0:0:0:0:0:0:0:30211)(secure=disabled):MBeanRegistry@128]
- Unregister MBean [org.apache.ZooKeeperService:name0=ReplicatedServer_id5,name1=replica.5]
    [junit] 2015-11-02 03:44:03,917 [myid:] - INFO  [main:QuorumUtil@254] - Shutting down
leader election QuorumPeer[myid=5](plain=/0:0:0:0:0:0:0:0:30211)(secure=disabled)
    [junit] 2015-11-02 03:44:03,918 [myid:] - INFO  [main:QuorumUtil@259] - Waiting for QuorumPeer[myid=5](plain=/0:0:0:0:0:0:0:0:30211)(secure=disabled)
to exit thread
    [junit] 2015-11-02 03:44:03,917 [myid:] - INFO  [QuorumPeer[myid=5](plain=/0:0:0:0:0:0:0:0:30211)(secure=disabled):MBeanRegistry@128]
- Unregister MBean [org.apache.ZooKeeperService:name0=ReplicatedServer_id5,name1=replica.1]
    [junit] 2015-11-02 03:44:03,918 [myid:] - INFO  [QuorumPeer[myid=5](plain=/0:0:0:0:0:0:0:0:30211)(secure=disabled):MBeanRegistry@128]
- Unregister MBean [org.apache.ZooKeeperService:name0=ReplicatedServer_id5,name1=replica.2]
    [junit] 2015-11-02 03:44:03,918 [myid:] - INFO  [QuorumPeer[myid=5](plain=/0:0:0:0:0:0:0:0:30211)(secure=disabled):MBeanRegistry@128]
- Unregister MBean [org.apache.ZooKeeperService:name0=ReplicatedServer_id5,name1=replica.3]
    [junit] 2015-11-02 03:44:03,918 [myid:] - INFO  [main:FourLetterWordMain@84] - connecting
to 127.0.0.1 30199
    [junit] 2015-11-02 03:44:03,919 [myid:] - INFO  [main:QuorumUtil@243] - 127.0.0.1:30199
is no longer accepting client connections
    [junit] 2015-11-02 03:44:03,919 [myid:] - INFO  [main:FourLetterWordMain@84] - connecting
to 127.0.0.1 30202
    [junit] 2015-11-02 03:44:03,919 [myid:] - INFO  [main:QuorumUtil@243] - 127.0.0.1:30202
is no longer accepting client connections
    [junit] 2015-11-02 03:44:03,919 [myid:] - INFO  [main:FourLetterWordMain@84] - connecting
to 127.0.0.1 30205
    [junit] 2015-11-02 03:44:03,920 [myid:] - INFO  [main:QuorumUtil@243] - 127.0.0.1:30205
is no longer accepting client connections
    [junit] 2015-11-02 03:44:03,920 [myid:] - INFO  [main:FourLetterWordMain@84] - connecting
to 127.0.0.1 30208
    [junit] 2015-11-02 03:44:03,920 [myid:] - INFO  [main:QuorumUtil@243] - 127.0.0.1:30208
is no longer accepting client connections
    [junit] 2015-11-02 03:44:03,920 [myid:] - INFO  [main:FourLetterWordMain@84] - connecting
to 127.0.0.1 30211
    [junit] 2015-11-02 03:44:03,920 [myid:] - INFO  [main:QuorumUtil@243] - 127.0.0.1:30211
is no longer accepting client connections
    [junit] 2015-11-02 03:44:03,922 [myid:] - INFO  [main:ZKTestCase$1@65] - SUCCEEDED testRemoveOneAsynchronous
    [junit] 2015-11-02 03:44:03,922 [myid:] - INFO  [main:ZKTestCase$1@60] - FINISHED testRemoveOneAsynchronous
    [junit] Tests run: 11, Failures: 1, Errors: 0, Skipped: 0, Time elapsed: 116.845 sec,
Thread: 8, Class: org.apache.zookeeper.test.ReconfigTest
    [junit] 2015-11-02 03:44:03,932 [myid:] - INFO  [main-SendThread(127.0.0.1:30103):ClientCnxn$SendThread@1138]
- Opening socket connection to server 127.0.0.1/127.0.0.1:30103. Will not attempt to authenticate
using SASL (unknown error)
    [junit] 2015-11-02 03:44:03,932 [myid:] - WARN  [main-SendThread(127.0.0.1:30103):ClientCnxn$SendThread@1257]
- Session 0x10062d7ed830001 for server 127.0.0.1/127.0.0.1:30103, unexpected error, closing
socket connection and attempting reconnect
    [junit] java.net.ConnectException: Connection refused
    [junit] 	at sun.nio.ch.SocketChannelImpl.checkConnect(Native Method)
    [junit] 	at sun.nio.ch.SocketChannelImpl.finishConnect(SocketChannelImpl.java:739)
    [junit] 	at org.apache.zookeeper.ClientCnxnSocketNIO.doTransport(ClientCnxnSocketNIO.java:355)
    [junit] 	at org.apache.zookeeper.ClientCnxn$SendThread.run(ClientCnxn.java:1236)
    [junit] Test org.apache.zookeeper.test.ReconfigTest FAILED

BUILD FAILED
/home/jenkins/jenkins-slave/workspace/ZooKeeper_branch35_jdk7/branch-3.5/build.xml:1494: The
following error occurred while executing this line:
/home/jenkins/jenkins-slave/workspace/ZooKeeper_branch35_jdk7/branch-3.5/build.xml:1379: Tests
failed!

Total time: 6 minutes 5 seconds
Build step 'Invoke Ant' marked build as failure
Archiving artifacts
Recording test results
Email was triggered for: Failure - Any
Sending email for trigger: Failure - Any



###################################################################################
############################## FAILED TESTS (if any) ##############################
2 tests failed.
FAILED:  org.apache.zookeeper.server.quorum.ReconfigRecoveryTest.testCurrentObserverIsParticipantInNewConfig

Error Message:
waiting for server 2 being up

Stack Trace:
junit.framework.AssertionFailedError: waiting for server 2 being up
	at org.apache.zookeeper.server.quorum.ReconfigRecoveryTest.testCurrentObserverIsParticipantInNewConfig(ReconfigRecoveryTest.java:529)
	at org.apache.zookeeper.JUnit4ZKTestRunner$LoggedInvokeMethod.evaluate(JUnit4ZKTestRunner.java:79)


FAILED:  org.apache.zookeeper.test.ReconfigTest.testPortChange

Error Message:
expected:<test[1]> but was:<test[0]>

Stack Trace:
junit.framework.AssertionFailedError: expected:<test[1]> but was:<test[0]>
	at org.apache.zookeeper.test.ReconfigTest.testNormalOperation(ReconfigTest.java:150)
	at org.apache.zookeeper.test.ReconfigTest.testPortChange(ReconfigTest.java:598)
	at org.apache.zookeeper.JUnit4ZKTestRunner$LoggedInvokeMethod.evaluate(JUnit4ZKTestRunner.java:79)



Mime
  • Unnamed multipart/mixed (inline, None, 0 bytes)
View raw message