zookeeper-dev mailing list archives

Site index · List index
Message view « Date » · « Thread »
Top « Date » · « Thread »
From Apache Jenkins Server <jenk...@builds.apache.org>
Subject ZooKeeper-trunk - Build # 2807 - Still Failing
Date Mon, 02 Nov 2015 02:19:48 GMT
See https://builds.apache.org/job/ZooKeeper-trunk/2807/

###################################################################################
########################## LAST 60 LINES OF THE CONSOLE ###########################
[...truncated 372510 lines...]
    [junit] 2015-11-02 02:19:37,858 [myid:] - INFO  [NIOServerCxnFactory.AcceptThread:0.0.0.0/0.0.0.0:24828:NIOServerCnxnFactory$AcceptThread@219]
- accept thread exitted run method
    [junit] 2015-11-02 02:19:37,860 [myid:] - INFO  [QuorumPeer[myid=5](plain=/0:0:0:0:0:0:0:0:24828)(secure=disabled):MBeanRegistry@128]
- Unregister MBean [org.apache.ZooKeeperService:name0=ReplicatedServer_id5,name1=replica.5,name2=Leader]
    [junit] 2015-11-02 02:19:37,860 [myid:] - INFO  [/127.0.0.1:24830:QuorumCnxManager$Listener@659]
- Leaving listener
    [junit] 2015-11-02 02:19:37,860 [myid:] - WARN  [QuorumPeer[myid=5](plain=/0:0:0:0:0:0:0:0:24828)(secure=disabled):QuorumPeer@1111]
- Unexpected exception
    [junit] java.lang.InterruptedException
    [junit] 	at java.lang.Object.wait(Native Method)
    [junit] 	at org.apache.zookeeper.server.quorum.Leader.lead(Leader.java:559)
    [junit] 	at org.apache.zookeeper.server.quorum.QuorumPeer.run(QuorumPeer.java:1108)
    [junit] 2015-11-02 02:19:37,860 [myid:] - INFO  [QuorumPeer[myid=5](plain=/0:0:0:0:0:0:0:0:24828)(secure=disabled):Leader@613]
- Shutting down
    [junit] 2015-11-02 02:19:37,860 [myid:] - WARN  [QuorumPeer[myid=5](plain=/0:0:0:0:0:0:0:0:24828)(secure=disabled):QuorumPeer@1142]
- PeerState set to LOOKING
    [junit] 2015-11-02 02:19:37,860 [myid:] - WARN  [QuorumPeer[myid=5](plain=/0:0:0:0:0:0:0:0:24828)(secure=disabled):QuorumPeer@1124]
- QuorumPeer main thread exited
    [junit] 2015-11-02 02:19:37,860 [myid:] - INFO  [QuorumPeer[myid=5](plain=/0:0:0:0:0:0:0:0:24828)(secure=disabled):MBeanRegistry@128]
- Unregister MBean [org.apache.ZooKeeperService:name0=ReplicatedServer_id5]
    [junit] 2015-11-02 02:19:37,860 [myid:] - INFO  [QuorumPeer[myid=5](plain=/0:0:0:0:0:0:0:0:24828)(secure=disabled):MBeanRegistry@128]
- Unregister MBean [org.apache.ZooKeeperService:name0=ReplicatedServer_id5,name1=replica.5]
    [junit] 2015-11-02 02:19:37,861 [myid:] - INFO  [QuorumPeer[myid=5](plain=/0:0:0:0:0:0:0:0:24828)(secure=disabled):MBeanRegistry@128]
- Unregister MBean [org.apache.ZooKeeperService:name0=ReplicatedServer_id5,name1=replica.1]
    [junit] 2015-11-02 02:19:37,861 [myid:] - INFO  [QuorumPeer[myid=5](plain=/0:0:0:0:0:0:0:0:24828)(secure=disabled):MBeanRegistry@128]
- Unregister MBean [org.apache.ZooKeeperService:name0=ReplicatedServer_id5,name1=replica.2]
    [junit] 2015-11-02 02:19:37,861 [myid:] - INFO  [QuorumPeer[myid=5](plain=/0:0:0:0:0:0:0:0:24828)(secure=disabled):MBeanRegistry@128]
- Unregister MBean [org.apache.ZooKeeperService:name0=ReplicatedServer_id5,name1=replica.3]
    [junit] 2015-11-02 02:19:37,864 [myid:] - INFO  [main:QuorumUtil@254] - Shutting down
leader election QuorumPeer[myid=5](plain=/0:0:0:0:0:0:0:0:24828)(secure=disabled)
    [junit] 2015-11-02 02:19:37,864 [myid:] - INFO  [main:QuorumUtil@259] - Waiting for QuorumPeer[myid=5](plain=/0:0:0:0:0:0:0:0:24828)(secure=disabled)
to exit thread
    [junit] 2015-11-02 02:19:37,864 [myid:] - INFO  [main:FourLetterWordMain@84] - connecting
to 127.0.0.1 24816
    [junit] 2015-11-02 02:19:37,864 [myid:] - INFO  [main:QuorumUtil@243] - 127.0.0.1:24816
is no longer accepting client connections
    [junit] 2015-11-02 02:19:37,864 [myid:] - INFO  [main:FourLetterWordMain@84] - connecting
to 127.0.0.1 24819
    [junit] 2015-11-02 02:19:37,865 [myid:] - INFO  [main:QuorumUtil@243] - 127.0.0.1:24819
is no longer accepting client connections
    [junit] 2015-11-02 02:19:37,865 [myid:] - INFO  [main:FourLetterWordMain@84] - connecting
to 127.0.0.1 24822
    [junit] 2015-11-02 02:19:37,865 [myid:] - INFO  [main:QuorumUtil@243] - 127.0.0.1:24822
is no longer accepting client connections
    [junit] 2015-11-02 02:19:37,865 [myid:] - INFO  [main:FourLetterWordMain@84] - connecting
to 127.0.0.1 24825
    [junit] 2015-11-02 02:19:37,868 [myid:] - INFO  [main:QuorumUtil@243] - 127.0.0.1:24825
is no longer accepting client connections
    [junit] 2015-11-02 02:19:37,868 [myid:] - INFO  [main:FourLetterWordMain@84] - connecting
to 127.0.0.1 24828
    [junit] 2015-11-02 02:19:37,868 [myid:] - INFO  [main:QuorumUtil@243] - 127.0.0.1:24828
is no longer accepting client connections
    [junit] 2015-11-02 02:19:37,872 [myid:] - INFO  [main:ZKTestCase$1@65] - SUCCEEDED testRemoveOneAsynchronous
    [junit] 2015-11-02 02:19:37,872 [myid:] - INFO  [main:ZKTestCase$1@60] - FINISHED testRemoveOneAsynchronous
    [junit] Tests run: 11, Failures: 0, Errors: 0, Skipped: 0, Time elapsed: 125.006 sec,
Thread: 6, Class: org.apache.zookeeper.test.ReconfigTest
    [junit] 2015-11-02 02:19:38,065 [myid:] - INFO  [main-SendThread(127.0.0.1:24725):ClientCnxn$SendThread@1138]
- Opening socket connection to server 127.0.0.1/127.0.0.1:24725. Will not attempt to authenticate
using SASL (unknown error)
    [junit] 2015-11-02 02:19:38,066 [myid:] - WARN  [main-SendThread(127.0.0.1:24725):ClientCnxn$SendThread@1257]
- Session 0x10164ecc0000000 for server 127.0.0.1/127.0.0.1:24725, unexpected error, closing
socket connection and attempting reconnect
    [junit] java.net.ConnectException: Connection refused
    [junit] 	at sun.nio.ch.SocketChannelImpl.checkConnect(Native Method)
    [junit] 	at sun.nio.ch.SocketChannelImpl.finishConnect(SocketChannelImpl.java:708)
    [junit] 	at org.apache.zookeeper.ClientCnxnSocketNIO.doTransport(ClientCnxnSocketNIO.java:355)
    [junit] 	at org.apache.zookeeper.ClientCnxn$SendThread.run(ClientCnxn.java:1236)

BUILD FAILED
/home/jenkins/jenkins-slave/workspace/ZooKeeper-trunk/trunk/build.xml:1494: The following
error occurred while executing this line:
/home/jenkins/jenkins-slave/workspace/ZooKeeper-trunk/trunk/build.xml:1379: Tests failed!

Total time: 6 minutes 28 seconds
Build step 'Execute shell' marked build as failure
[FINDBUGS] Skipping publisher since build result is FAILURE
[WARNINGS] Skipping publisher since build result is FAILURE
Archiving artifacts
Setting JDK_1_7_LATEST__HOME=/home/jenkins/tools/java/latest1.7
Recording fingerprints
Setting JDK_1_7_LATEST__HOME=/home/jenkins/tools/java/latest1.7
Recording test results
Setting JDK_1_7_LATEST__HOME=/home/jenkins/tools/java/latest1.7
Publishing Javadoc
Setting JDK_1_7_LATEST__HOME=/home/jenkins/tools/java/latest1.7
Email was triggered for: Failure - Any
Sending email for trigger: Failure - Any
Setting JDK_1_7_LATEST__HOME=/home/jenkins/tools/java/latest1.7
Setting JDK_1_7_LATEST__HOME=/home/jenkins/tools/java/latest1.7



###################################################################################
############################## FAILED TESTS (if any) ##############################
1 tests failed.
FAILED:  org.apache.zookeeper.test.ClientPortBindTest.testBindByAddress

Error Message:
Forked Java VM exited abnormally. Please note the time in the report does not reflect the
time until the VM exit.

Stack Trace:
junit.framework.AssertionFailedError: Forked Java VM exited abnormally. Please note the time
in the report does not reflect the time until the VM exit.
	at java.lang.Thread.run(Thread.java:724)



Mime
  • Unnamed multipart/mixed (inline, None, 0 bytes)
View raw message