zookeeper-dev mailing list archives

Site index · List index
Message view « Date » · « Thread »
Top « Date » · « Thread »
From Apache Jenkins Server <jenk...@builds.apache.org>
Subject Failed: ZOOKEEPER-2174 PreCommit Build #2664
Date Fri, 01 May 2015 07:28:59 GMT
Jira: https://issues.apache.org/jira/browse/ZOOKEEPER-2174
Build: https://builds.apache.org/job/PreCommit-ZOOKEEPER-Build/2664/

###################################################################################
########################## LAST 60 LINES OF THE CONSOLE ###########################
[...truncated 89 lines...]
     [exec] 
     [exec] patching file src/java/test/org/apache/zookeeper/JUnit4ZKTestRunner.java
     [exec] Hunk #2 FAILED at 39.
     [exec] 1 out of 3 hunks FAILED -- saving rejects to file src/java/test/org/apache/zookeeper/JUnit4ZKTestRunner.java.rej
     [exec] PATCH APPLICATION FAILED
     [exec] 
     [exec] 
     [exec] 
     [exec] 
     [exec] -1 overall.  Here are the results of testing the latest attachment 
     [exec]   http://issues.apache.org/jira/secure/attachment/12729718/ZOOKEEPER-2174-branch-3.4.004.patch
     [exec]   against trunk revision 1676359.
     [exec] 
     [exec]     +1 @author.  The patch does not contain any @author tags.
     [exec] 
     [exec]     +1 tests included.  The patch appears to include 3 new or modified tests.
     [exec] 
     [exec]     -1 patch.  The patch command could not apply the patch.
     [exec] 
     [exec] Console output: https://builds.apache.org/job/PreCommit-ZOOKEEPER-Build/2664//console
     [exec] 
     [exec] This message is automatically generated.
     [exec] 
     [exec] 
     [exec] ======================================================================
     [exec] ======================================================================
     [exec]     Adding comment to Jira.
     [exec] ======================================================================
     [exec] ======================================================================
     [exec] 
     [exec] 
     [exec] Comment added.
     [exec] af2298f22eb882c97c8c2e4b73bd524f75c3c6cd logged out
     [exec] 
     [exec] 
     [exec] ======================================================================
     [exec] ======================================================================
     [exec]     Finished build.
     [exec] ======================================================================
     [exec] ======================================================================
     [exec] 
     [exec] 

BUILD FAILED
/home/jenkins/jenkins-slave/workspace/PreCommit-ZOOKEEPER-Build@2/trunk/build.xml:1721: exec
returned: 1

Total time: 40 seconds
Build step 'Execute shell' marked build as failure
Archiving artifacts
Sending artifact delta relative to PreCommit-ZOOKEEPER-Build #2660
Archived 1 artifacts
Archive block size is 32768
Received 0 blocks and 61016 bytes
Compression is 0.0%
Took 5 sec
Recording test results
Description set: ZOOKEEPER-2174
Email was triggered for: Failure
Sending email for trigger: Failure



###################################################################################
############################## FAILED TESTS (if any) ##############################
No tests ran.
Mime
  • Unnamed multipart/mixed (inline, None, 0 bytes)
View raw message