zookeeper-dev mailing list archives

Site index · List index
Message view « Date » · « Thread »
Top « Date » · « Thread »
From Apache Jenkins Server <jenk...@builds.apache.org>
Subject ZooKeeper_branch35_jdk7 - Build # 286 - Failure
Date Wed, 06 May 2015 11:49:31 GMT
See https://builds.apache.org/job/ZooKeeper_branch35_jdk7/286/

###################################################################################
########################## LAST 60 LINES OF THE CONSOLE ###########################
[...truncated 365536 lines...]
     [exec] Log Message Received: [2015-05-06 11:47:34,871:25498(0x2acc30bc2540):ZOO_INFO@log_env@980:
Client environment:host.name=proserpina.apache.org]
     [exec] Log Message Received: [2015-05-06 11:47:34,871:25498(0x2acc30bc2540):ZOO_INFO@log_env@987:
Client environment:os.name=Linux]
     [exec] Log Message Received: [2015-05-06 11:47:34,871:25498(0x2acc30bc2540):ZOO_INFO@log_env@988:
Client environment:os.arch=3.13.0-36-lowlatency]
     [exec] Log Message Received: [2015-05-06 11:47:34,871:25498(0x2acc30bc2540):ZOO_INFO@log_env@989:
Client environment:os.version=#63-Ubuntu SMP PREEMPT Wed Sep 3 21:56:12 UTC 2014]
     [exec] Log Message Received: [2015-05-06 11:47:34,871:25498(0x2acc30bc2540):ZOO_INFO@log_env@997:
Client environment:user.name=jenkins]
     [exec] Log Message Received: [2015-05-06 11:47:34,871:25498(0x2acc30bc2540):ZOO_INFO@log_env@1005:
Client environment:user.home=/home/jenkins]
     [exec] Log Message Received: [2015-05-06 11:47:34,871:25498(0x2acc30bc2540):ZOO_INFO@log_env@1017:
Client environment:user.dir=/home/jenkins/jenkins-slave/workspace/ZooKeeper_branch35_jdk7/branch-3.5/build/test/test-cppunit]
     [exec] Log Message Received: [2015-05-06 11:47:34,871:25498(0x2acc30bc2540):ZOO_INFO@zookeeper_init_internal@1060:
Initiating client connection, host=127.0.0.1:22181 sessionTimeout=10000 watcher=0x45d350 sessionId=0
sessionPasswd=<null> context=0x7fff40e3d910 flags=0]
     [exec] Log Message Received: [2015-05-06 11:47:34,871:25498(0x2acc33251700):ZOO_INFO@check_events@2298:
initiated connection to server [127.0.0.1:22181]]
     [exec] Log Message Received: [2015-05-06 11:47:34,891:25498(0x2acc33251700):ZOO_INFO@check_events@2350:
session establishment complete on server [127.0.0.1:22181], sessionId=0x10027fd3251000f, negotiated
timeout=10000 ]
     [exec]  : elapsed 1000 : OK
     [exec] Zookeeper_simpleSystem::testAsyncWatcherAutoReset ZooKeeper server started : elapsed
10126 : OK
     [exec] Zookeeper_simpleSystem::testDeserializeString : elapsed 0 : OK
     [exec] Zookeeper_simpleSystem::testFirstServerDown : elapsed 1001 : OK
     [exec] Zookeeper_simpleSystem::testNullData : elapsed 1056 : OK
     [exec] Zookeeper_simpleSystem::testIPV6 : elapsed 1017 : OK
     [exec] Zookeeper_simpleSystem::testCreate : elapsed 1025 : OK
     [exec] Zookeeper_simpleSystem::testPath : elapsed 1049 : OK
     [exec] Zookeeper_simpleSystem::testPathValidation : elapsed 1150 : OK
     [exec] Zookeeper_simpleSystem::testPing : elapsed 17664 : OK
     [exec] Zookeeper_simpleSystem::testAcl : elapsed 1034 : OK
     [exec] Zookeeper_simpleSystem::testChroot : elapsed 3110 : OK
     [exec] Zookeeper_simpleSystem::testAuth ZooKeeper server started ZooKeeper server started
: elapsed 30324 : OK
     [exec] Zookeeper_simpleSystem::testHangingClient : elapsed 1043 : OK
     [exec] Zookeeper_simpleSystem::testWatcherAutoResetWithGlobal ZooKeeper server started
ZooKeeper server started ZooKeeper server started : elapsed 14587 : OK
     [exec] Zookeeper_simpleSystem::testWatcherAutoResetWithLocal ZooKeeper server started
ZooKeeper server started ZooKeeper server started : elapsed 14618 : OK
     [exec] Zookeeper_simpleSystem::testGetChildren2 : elapsed 1064 : OK
     [exec] Zookeeper_simpleSystem::testLastZxid : elapsed 4527 : OK
     [exec] Zookeeper_simpleSystem::testRemoveWatchers ZooKeeper server started : elapsed
4212 : OK
     [exec] Zookeeper_readOnly::testReadOnly : elapsed 4100 : OK
     [exec] /home/jenkins/jenkins-slave/workspace/ZooKeeper_branch35_jdk7/branch-3.5/src/c/tests/TestReconfig.cc:183:
Assertion: equality assertion failed [Expected: 1, Actual  : 0]
     [exec] Failures !!!
     [exec] Run: 72   Failure total: 1   Failures: 1   Errors: 0
     [exec] FAIL: zktest-mt
     [exec] ==========================================
     [exec] 1 of 2 tests failed
     [exec] Please report to user@zookeeper.apache.org
     [exec] ==========================================
     [exec] make[1]: Leaving directory `/home/jenkins/jenkins-slave/workspace/ZooKeeper_branch35_jdk7/branch-3.5/build/test/test-cppunit'
     [exec] make[1]: *** [check-TESTS] Error 1
     [exec] make: *** [check-am] Error 2

BUILD FAILED
/home/jenkins/jenkins-slave/workspace/ZooKeeper_branch35_jdk7/branch-3.5/build.xml:1439: The
following error occurred while executing this line:
/home/jenkins/jenkins-slave/workspace/ZooKeeper_branch35_jdk7/branch-3.5/build.xml:1399: The
following error occurred while executing this line:
/home/jenkins/jenkins-slave/workspace/ZooKeeper_branch35_jdk7/branch-3.5/build.xml:1409: exec
returned: 2

Total time: 53 minutes 12 seconds
Build step 'Invoke Ant' marked build as failure
Archiving artifacts
Sending artifact delta relative to ZooKeeper_branch35_jdk7 #285
Archived 2 artifacts
Archive block size is 32768
Received 1 blocks and 41837 bytes
Compression is 43.9%
Took 0.19 sec
Recording test results
Email was triggered for: Failure
Sending email for trigger: Failure



###################################################################################
############################## FAILED TESTS (if any) ##############################
All tests passed
Mime
  • Unnamed multipart/mixed (inline, None, 0 bytes)
View raw message