zookeeper-dev mailing list archives

Site index · List index
Message view « Date » · « Thread »
Top « Date » · « Thread »
From Apache Jenkins Server <jenk...@builds.apache.org>
Subject Failed: ZOOKEEPER-1884 PreCommit Build #2662
Date Fri, 01 May 2015 03:47:17 GMT
Jira: https://issues.apache.org/jira/browse/ZOOKEEPER-1884
Build: https://builds.apache.org/job/PreCommit-ZOOKEEPER-Build/2662/

###################################################################################
########################## LAST 60 LINES OF THE CONSOLE ###########################
[...truncated 91 lines...]
     [exec] Hunk #1 FAILED at 813.
     [exec] 1 out of 1 hunk FAILED -- saving rejects to file src/java/main/org/apache/zookeeper/ZooKeeperMain.java.rej
     [exec] PATCH APPLICATION FAILED
     [exec] 
     [exec] 
     [exec] 
     [exec] 
     [exec] -1 overall.  Here are the results of testing the latest attachment 
     [exec]   http://issues.apache.org/jira/secure/attachment/12729677/ZOOKEEPER-1884.patch
     [exec]   against trunk revision 1676359.
     [exec] 
     [exec]     +1 @author.  The patch does not contain any @author tags.
     [exec] 
     [exec]     -1 tests included.  The patch doesn't appear to include any new or modified
tests.
     [exec]                         Please justify why no new tests are needed for this patch.
     [exec]                         Also please list what manual steps were performed to verify
this patch.
     [exec] 
     [exec]     -1 patch.  The patch command could not apply the patch.
     [exec] 
     [exec] Console output: https://builds.apache.org/job/PreCommit-ZOOKEEPER-Build/2662//console
     [exec] 
     [exec] This message is automatically generated.
     [exec] 
     [exec] 
     [exec] ======================================================================
     [exec] ======================================================================
     [exec]     Adding comment to Jira.
     [exec] ======================================================================
     [exec] ======================================================================
     [exec] 
     [exec] 
     [exec] Comment added.
     [exec] 3240147b78171237c9cf1d193879281b7be799df logged out
     [exec] 
     [exec] 
     [exec] ======================================================================
     [exec] ======================================================================
     [exec]     Finished build.
     [exec] ======================================================================
     [exec] ======================================================================
     [exec] 
     [exec] 

BUILD FAILED
/home/jenkins/jenkins-slave/workspace/PreCommit-ZOOKEEPER-Build/trunk/build.xml:1721: exec
returned: 1

Total time: 42 seconds
Build step 'Execute shell' marked build as failure
Archiving artifacts
Sending artifact delta relative to PreCommit-ZOOKEEPER-Build #2660
Archived 1 artifacts
Archive block size is 32768
Received 0 blocks and 60637 bytes
Compression is 0.0%
Took 8.6 sec
Recording test results
Description set: ZOOKEEPER-1884
Email was triggered for: Failure
Sending email for trigger: Failure



###################################################################################
############################## FAILED TESTS (if any) ##############################
No tests ran.
Mime
  • Unnamed multipart/mixed (inline, None, 0 bytes)
View raw message