zookeeper-dev mailing list archives

Site index · List index
Message view « Date » · « Thread »
Top « Date » · « Thread »
From Apache Jenkins Server <jenk...@builds.apache.org>
Subject ZooKeeper-trunk - Build # 2684 - Still Failing
Date Thu, 07 May 2015 11:17:42 GMT
See https://builds.apache.org/job/ZooKeeper-trunk/2684/

###################################################################################
########################## LAST 60 LINES OF THE CONSOLE ###########################
[...truncated 364965 lines...]
     [exec] Log Message Received: [2015-05-07 11:15:37,076:3391(0x2ad95fc6b540):ZOO_INFO@log_env@1005:
Client environment:user.home=/home/jenkins]
     [exec] Log Message Received: [2015-05-07 11:15:37,076:3391(0x2ad95fc6b540):ZOO_INFO@log_env@1017:
Client environment:user.dir=/home/jenkins/jenkins-slave/workspace/ZooKeeper-trunk/trunk/build/test/test-cppunit]
     [exec] Log Message Received: [2015-05-07 11:15:37,076:3391(0x2ad95fc6b540):ZOO_INFO@zookeeper_init_internal@1060:
Initiating client connection, host=127.0.0.1:22181 sessionTimeout=10000 watcher=0x45d350 sessionId=0
sessionPasswd=<null> context=0x7fffe8112cf0 flags=0]
     [exec] Log Message Received: [2015-05-07 11:15:37,076:3391(0x2ad9622fa700):ZOO_INFO@check_events@2298:
initiated connection to server [127.0.0.1:22181]]
     [exec] Log Message Received: [2015-05-07 11:15:37,079:3391(0x2ad9622fa700):ZOO_INFO@check_events@2350:
session establishment complete on server [127.0.0.1:22181], sessionId=0x101be0a3eab000f, negotiated
timeout=10000 ]
     [exec]  : elapsed 1001 : OK
     [exec] Zookeeper_simpleSystem::testAsyncWatcherAutoReset ZooKeeper server started : elapsed
10106 : OK
     [exec] Zookeeper_simpleSystem::testDeserializeString : elapsed 0 : OK
     [exec] Zookeeper_simpleSystem::testFirstServerDown : elapsed 1001 : OK
     [exec] Zookeeper_simpleSystem::testNullData : elapsed 1020 : OK
     [exec] Zookeeper_simpleSystem::testIPV6 : elapsed 1003 : OK
     [exec] Zookeeper_simpleSystem::testCreate : elapsed 1007 : OK
     [exec] Zookeeper_simpleSystem::testPath : elapsed 1012 : OK
     [exec] Zookeeper_simpleSystem::testPathValidation : elapsed 1036 : OK
     [exec] Zookeeper_simpleSystem::testPing : elapsed 17164 : OK
     [exec] Zookeeper_simpleSystem::testAcl : elapsed 1012 : OK
     [exec] Zookeeper_simpleSystem::testChroot : elapsed 3032 : OK
     [exec] Zookeeper_simpleSystem::testAuth ZooKeeper server started ZooKeeper server started
: elapsed 30236 : OK
     [exec] Zookeeper_simpleSystem::testHangingClient : elapsed 1021 : OK
     [exec] Zookeeper_simpleSystem::testWatcherAutoResetWithGlobal ZooKeeper server started
ZooKeeper server started ZooKeeper server started : elapsed 14382 : OK
     [exec] Zookeeper_simpleSystem::testWatcherAutoResetWithLocal ZooKeeper server started
ZooKeeper server started ZooKeeper server started : elapsed 14395 : OK
     [exec] Zookeeper_simpleSystem::testGetChildren2 : elapsed 1029 : OK
     [exec] Zookeeper_simpleSystem::testLastZxid : elapsed 4510 : OK
     [exec] Zookeeper_simpleSystem::testRemoveWatchers ZooKeeper server started : elapsed
4170 : OK
     [exec] Zookeeper_readOnly::testReadOnly : elapsed 4091 : OK
     [exec] /home/jenkins/jenkins-slave/workspace/ZooKeeper-trunk/trunk/src/c/tests/TestReconfig.cc:183:
Assertion: equality assertion failed [Expected: 1, Actual  : 0]
     [exec] Failures !!!
     [exec] Run: 72   Failure total: 1   Failures: 1   Errors: 0
     [exec] FAIL: zktest-mt
     [exec] ==========================================
     [exec] 1 of 2 tests failed
     [exec] Please report to user@zookeeper.apache.org
     [exec] ==========================================
     [exec] make[1]: Leaving directory `/home/jenkins/jenkins-slave/workspace/ZooKeeper-trunk/trunk/build/test/test-cppunit'
     [exec] make[1]: *** [check-TESTS] Error 1
     [exec] make: *** [check-am] Error 2

BUILD FAILED
/home/jenkins/jenkins-slave/workspace/ZooKeeper-trunk/trunk/build.xml:1439: The following
error occurred while executing this line:
/home/jenkins/jenkins-slave/workspace/ZooKeeper-trunk/trunk/build.xml:1399: The following
error occurred while executing this line:
/home/jenkins/jenkins-slave/workspace/ZooKeeper-trunk/trunk/build.xml:1409: exec returned:
2

Total time: 45 minutes 40 seconds
Build step 'Execute shell' marked build as failure
[FINDBUGS] Skipping publisher since build result is FAILURE
[WARNINGS] Skipping publisher since build result is FAILURE
Archiving artifacts
Sending artifact delta relative to ZooKeeper-trunk #2682
Archived 5 artifacts
Archive block size is 32768
Received 2 blocks and 18213611 bytes
Compression is 0.4%
Took 7.6 sec
Recording fingerprints
Updating ZOOKEEPER-2153
Recording test results
Publishing Javadoc
Email was triggered for: Failure
Sending email for trigger: Failure



###################################################################################
############################## FAILED TESTS (if any) ##############################
All tests passed
Mime
  • Unnamed multipart/mixed (inline, None, 0 bytes)
View raw message