zookeeper-dev mailing list archives

Site index · List index
Message view « Date » · « Thread »
Top « Date » · « Thread »
From Apache Jenkins Server <jenk...@builds.apache.org>
Subject ZooKeeper_branch34_solaris - Build # 1008 - Still Failing
Date Sun, 17 May 2015 08:23:41 GMT
See https://builds.apache.org/job/ZooKeeper_branch34_solaris/1008/

###################################################################################
########################## LAST 60 LINES OF THE CONSOLE ###########################
[...truncated 168668 lines...]
    [junit] 2015-05-17 08:22:50,458 [myid:] - INFO  [main:JMXEnv@246] - expect:StandaloneServer_port
    [junit] 2015-05-17 08:22:50,459 [myid:] - INFO  [main:JMXEnv@250] - found:StandaloneServer_port
org.apache.ZooKeeperService:name0=StandaloneServer_port11221
    [junit] 2015-05-17 08:22:50,459 [myid:] - INFO  [main:ClientBase@490] - STOPPING server
    [junit] 2015-05-17 08:22:50,460 [myid:] - INFO  [main:ZooKeeperServer@441] - shutting
down
    [junit] 2015-05-17 08:22:50,460 [myid:] - INFO  [main:SessionTrackerImpl@225] - Shutting
down
    [junit] 2015-05-17 08:22:50,460 [myid:] - INFO  [main:PrepRequestProcessor@760] - Shutting
down
    [junit] 2015-05-17 08:22:50,460 [myid:] - INFO  [main:SyncRequestProcessor@209] - Shutting
down
    [junit] 2015-05-17 08:22:50,460 [myid:] - INFO  [ProcessThread(sid:0 cport:11221)::PrepRequestProcessor@143]
- PrepRequestProcessor exited loop!
    [junit] 2015-05-17 08:22:50,461 [myid:] - INFO  [SyncThread:0:SyncRequestProcessor@187]
- SyncRequestProcessor exited!
    [junit] 2015-05-17 08:22:50,461 [myid:] - INFO  [main:FinalRequestProcessor@415] - shutdown
of request processor complete
    [junit] 2015-05-17 08:22:50,461 [myid:] - INFO  [main:FourLetterWordMain@43] - connecting
to 127.0.0.1 11221
    [junit] 2015-05-17 08:22:50,462 [myid:] - INFO  [main:JMXEnv@146] - ensureOnly:[]
    [junit] 2015-05-17 08:22:50,463 [myid:] - INFO  [main:ClientBase@443] - STARTING server
    [junit] 2015-05-17 08:22:50,463 [myid:] - INFO  [main:ClientBase@364] - CREATING server
instance 127.0.0.1:11221
    [junit] 2015-05-17 08:22:50,463 [myid:] - INFO  [main:NIOServerCnxnFactory@94] - binding
to port 0.0.0.0/0.0.0.0:11221
    [junit] 2015-05-17 08:22:50,464 [myid:] - INFO  [main:ClientBase@339] - STARTING server
instance 127.0.0.1:11221
    [junit] 2015-05-17 08:22:50,464 [myid:] - INFO  [main:ZooKeeperServer@162] - Created server
with tickTime 3000 minSessionTimeout 6000 maxSessionTimeout 60000 datadir /zonestorage/hudson_solaris/home/hudson/hudson-slave/workspace/ZooKeeper_branch34_solaris/trunk/build/test/tmp/test3758712336282403142.junit.dir/version-2
snapdir /zonestorage/hudson_solaris/home/hudson/hudson-slave/workspace/ZooKeeper_branch34_solaris/trunk/build/test/tmp/test3758712336282403142.junit.dir/version-2
    [junit] 2015-05-17 08:22:50,467 [myid:] - INFO  [main:FourLetterWordMain@43] - connecting
to 127.0.0.1 11221
    [junit] 2015-05-17 08:22:50,468 [myid:] - INFO  [NIOServerCxn.Factory:0.0.0.0/0.0.0.0:11221:NIOServerCnxnFactory@197]
- Accepted socket connection from /127.0.0.1:49637
    [junit] 2015-05-17 08:22:50,468 [myid:] - INFO  [NIOServerCxn.Factory:0.0.0.0/0.0.0.0:11221:NIOServerCnxn@827]
- Processing stat command from /127.0.0.1:49637
    [junit] 2015-05-17 08:22:50,468 [myid:] - INFO  [Thread-5:NIOServerCnxn$StatCommand@663]
- Stat command output
    [junit] 2015-05-17 08:22:50,469 [myid:] - INFO  [Thread-5:NIOServerCnxn@1007] - Closed
socket connection for client /127.0.0.1:49637 (no session established for client)
    [junit] 2015-05-17 08:22:50,470 [myid:] - INFO  [main:JMXEnv@229] - ensureParent:[InMemoryDataTree,
StandaloneServer_port]
    [junit] 2015-05-17 08:22:50,471 [myid:] - INFO  [main:JMXEnv@246] - expect:InMemoryDataTree
    [junit] 2015-05-17 08:22:50,471 [myid:] - INFO  [main:JMXEnv@250] - found:InMemoryDataTree
org.apache.ZooKeeperService:name0=StandaloneServer_port11221,name1=InMemoryDataTree
    [junit] 2015-05-17 08:22:50,471 [myid:] - INFO  [main:JMXEnv@246] - expect:StandaloneServer_port
    [junit] 2015-05-17 08:22:50,472 [myid:] - INFO  [main:JMXEnv@250] - found:StandaloneServer_port
org.apache.ZooKeeperService:name0=StandaloneServer_port11221
    [junit] 2015-05-17 08:22:50,472 [myid:] - INFO  [main:JUnit4ZKTestRunner$LoggedInvokeMethod@58]
- Memory used 8870
    [junit] 2015-05-17 08:22:50,472 [myid:] - INFO  [main:JUnit4ZKTestRunner$LoggedInvokeMethod@63]
- Number of threads 20
    [junit] 2015-05-17 08:22:50,472 [myid:] - INFO  [main:JUnit4ZKTestRunner$LoggedInvokeMethod@78]
- FINISHED TEST METHOD testQuota
    [junit] 2015-05-17 08:22:50,472 [myid:] - INFO  [main:ClientBase@520] - tearDown starting
    [junit] 2015-05-17 08:22:50,552 [myid:] - INFO  [main-EventThread:ClientCnxn$EventThread@512]
- EventThread shut down for session: 0x14d60f7932e0000
    [junit] 2015-05-17 08:22:50,552 [myid:] - INFO  [main:ZooKeeper@684] - Session: 0x14d60f7932e0000
closed
    [junit] 2015-05-17 08:22:50,553 [myid:] - INFO  [main:ClientBase@490] - STOPPING server
    [junit] 2015-05-17 08:22:50,554 [myid:] - INFO  [main:ZooKeeperServer@441] - shutting
down
    [junit] 2015-05-17 08:22:50,554 [myid:] - INFO  [main:SessionTrackerImpl@225] - Shutting
down
    [junit] 2015-05-17 08:22:50,554 [myid:] - INFO  [main:PrepRequestProcessor@760] - Shutting
down
    [junit] 2015-05-17 08:22:50,554 [myid:] - INFO  [main:SyncRequestProcessor@209] - Shutting
down
    [junit] 2015-05-17 08:22:50,554 [myid:] - INFO  [ProcessThread(sid:0 cport:11221)::PrepRequestProcessor@143]
- PrepRequestProcessor exited loop!
    [junit] 2015-05-17 08:22:50,555 [myid:] - INFO  [SyncThread:0:SyncRequestProcessor@187]
- SyncRequestProcessor exited!
    [junit] 2015-05-17 08:22:50,555 [myid:] - INFO  [main:FinalRequestProcessor@415] - shutdown
of request processor complete
    [junit] 2015-05-17 08:22:50,555 [myid:] - INFO  [main:FourLetterWordMain@43] - connecting
to 127.0.0.1 11221
    [junit] 2015-05-17 08:22:50,556 [myid:] - INFO  [main:JMXEnv@146] - ensureOnly:[]
    [junit] 2015-05-17 08:22:50,560 [myid:] - INFO  [main:ClientBase@545] - fdcount after
test is: 42 at start it was 28
    [junit] 2015-05-17 08:22:50,560 [myid:] - INFO  [main:ClientBase@547] - sleeping for 20
secs
    [junit] 2015-05-17 08:22:50,560 [myid:] - INFO  [main:ZKTestCase$1@60] - SUCCEEDED testQuota
    [junit] 2015-05-17 08:22:50,561 [myid:] - INFO  [main:ZKTestCase$1@55] - FINISHED testQuota
    [junit] Tests run: 1, Failures: 0, Errors: 0, Time elapsed: 23.744 sec

BUILD FAILED
/zonestorage/hudson_solaris/home/hudson/hudson-slave/workspace/ZooKeeper_branch34_solaris/trunk/build.xml:1303:
Tests failed!

Total time: 46 minutes 40 seconds
Build step 'Invoke Ant' marked build as failure
[locks-and-latches] Releasing all the locks
[locks-and-latches] All the locks released
Recording test results
Email was triggered for: Failure
Sending email for trigger: Failure



###################################################################################
############################## FAILED TESTS (if any) ##############################
6 tests failed.
REGRESSION:  org.apache.zookeeper.server.ZxidRolloverTest.testSimpleRolloverFollower

Error Message:
waiting for server up

Stack Trace:
java.lang.AssertionError: waiting for server up
	at org.apache.zookeeper.test.QuorumUtil.startAll(QuorumUtil.java:136)
	at org.apache.zookeeper.server.ZxidRolloverTest.startAll(ZxidRolloverTest.java:149)
	at org.apache.zookeeper.server.ZxidRolloverTest.setUp(ZxidRolloverTest.java:64)


REGRESSION:  org.apache.zookeeper.server.ZxidRolloverTest.testRolloverThenRestart

Error Message:
waiting for server up

Stack Trace:
java.lang.AssertionError: waiting for server up
	at org.apache.zookeeper.test.QuorumUtil.startAll(QuorumUtil.java:136)
	at org.apache.zookeeper.server.ZxidRolloverTest.startAll(ZxidRolloverTest.java:149)
	at org.apache.zookeeper.server.ZxidRolloverTest.setUp(ZxidRolloverTest.java:64)


REGRESSION:  org.apache.zookeeper.test.AsyncHammerTest.testObserversHammer

Error Message:
thread HammerThread-0 still alive after join

Stack Trace:
junit.framework.AssertionFailedError: thread HammerThread-0 still alive after join
	at org.apache.zookeeper.test.ClientBase.verifyThreadTerminated(ClientBase.java:303)
	at org.apache.zookeeper.test.AsyncHammerTest.testObserversHammer(AsyncHammerTest.java:214)
	at org.apache.zookeeper.JUnit4ZKTestRunner$LoggedInvokeMethod.evaluate(JUnit4ZKTestRunner.java:55)


REGRESSION:  org.apache.zookeeper.test.ObserverTest.testObserver

Error Message:
waiting for server 1 being up

Stack Trace:
junit.framework.AssertionFailedError: waiting for server 1 being up
	at org.apache.zookeeper.test.ObserverTest.testObserver(ObserverTest.java:89)
	at org.apache.zookeeper.JUnit4ZKTestRunner$LoggedInvokeMethod.evaluate(JUnit4ZKTestRunner.java:55)


REGRESSION:  org.apache.zookeeper.test.RestoreCommittedLogTest.testRestoreCommittedLog

Error Message:
KeeperErrorCode = ConnectionLoss for /invalidsnap-0

Stack Trace:
org.apache.zookeeper.KeeperException$ConnectionLossException: KeeperErrorCode = ConnectionLoss
for /invalidsnap-0
	at org.apache.zookeeper.KeeperException.create(KeeperException.java:99)
	at org.apache.zookeeper.KeeperException.create(KeeperException.java:51)
	at org.apache.zookeeper.ZooKeeper.create(ZooKeeper.java:783)
	at org.apache.zookeeper.test.RestoreCommittedLogTest.testRestoreCommittedLog(RestoreCommittedLogTest.java:66)
	at org.apache.zookeeper.JUnit4ZKTestRunner$LoggedInvokeMethod.evaluate(JUnit4ZKTestRunner.java:55)


REGRESSION:  org.apache.zookeeper.test.ZkDatabaseCorruptionTest.testCorruption

Error Message:
Cannot find the leader.

Stack Trace:
junit.framework.AssertionFailedError: Cannot find the leader.
	at org.apache.zookeeper.test.ZkDatabaseCorruptionTest.testCorruption(ZkDatabaseCorruptionTest.java:108)
	at org.apache.zookeeper.JUnit4ZKTestRunner$LoggedInvokeMethod.evaluate(JUnit4ZKTestRunner.java:55)



Mime
  • Unnamed multipart/mixed (inline, None, 0 bytes)
View raw message