zookeeper-dev mailing list archives

Site index · List index
Message view « Date » · « Thread »
Top « Date » · « Thread »
From Apache Jenkins Server <jenk...@builds.apache.org>
Subject ZooKeeper_branch35_jdk7 - Build # 283 - Failure
Date Sun, 03 May 2015 10:21:05 GMT
See https://builds.apache.org/job/ZooKeeper_branch35_jdk7/283/

###################################################################################
########################## LAST 60 LINES OF THE CONSOLE ###########################
[...truncated 358743 lines...]
    [junit] 2015-05-03 10:21:02,358 [myid:] - INFO  [main:JMXEnv@142] - ensureOnly:[]
    [junit] 2015-05-03 10:21:02,359 [myid:] - INFO  [main:ClientBase@461] - STARTING server
    [junit] 2015-05-03 10:21:02,360 [myid:] - INFO  [main:ClientBase@381] - CREATING server
instance 127.0.0.1:11221
    [junit] 2015-05-03 10:21:02,360 [myid:] - INFO  [main:NIOServerCnxnFactory@673] - Configuring
NIO connection handler with 10s sessionless connection timeout, 2 selector thread(s), 32 worker
threads, and 64 kB direct buffers.
    [junit] 2015-05-03 10:21:02,360 [myid:] - INFO  [main:NIOServerCnxnFactory@686] - binding
to port 0.0.0.0/0.0.0.0:11221
    [junit] 2015-05-03 10:21:02,360 [myid:] - INFO  [main:ClientBase@356] - STARTING server
instance 127.0.0.1:11221
    [junit] 2015-05-03 10:21:02,361 [myid:] - INFO  [main:ZooKeeperServer@825] - minSessionTimeout
set to 6000
    [junit] 2015-05-03 10:21:02,361 [myid:] - INFO  [main:ZooKeeperServer@834] - maxSessionTimeout
set to 60000
    [junit] 2015-05-03 10:21:02,361 [myid:] - INFO  [main:ZooKeeperServer@156] - Created server
with tickTime 3000 minSessionTimeout 6000 maxSessionTimeout 60000 datadir /home/jenkins/jenkins-slave/workspace/ZooKeeper_branch35_jdk7/branch-3.5/build/test/tmp/test4161808377998354427.junit.dir/version-2
snapdir /home/jenkins/jenkins-slave/workspace/ZooKeeper_branch35_jdk7/branch-3.5/build/test/tmp/test4161808377998354427.junit.dir/version-2
    [junit] 2015-05-03 10:21:02,362 [myid:] - INFO  [main:FileSnap@83] - Reading snapshot
/home/jenkins/jenkins-slave/workspace/ZooKeeper_branch35_jdk7/branch-3.5/build/test/tmp/test4161808377998354427.junit.dir/version-2/snapshot.b
    [junit] 2015-05-03 10:21:02,364 [myid:] - INFO  [main:FileTxnSnapLog@298] - Snapshotting:
0xb to /home/jenkins/jenkins-slave/workspace/ZooKeeper_branch35_jdk7/branch-3.5/build/test/tmp/test4161808377998354427.junit.dir/version-2/snapshot.b
    [junit] 2015-05-03 10:21:02,366 [myid:] - INFO  [main:FourLetterWordMain@63] - connecting
to 127.0.0.1 11221
    [junit] 2015-05-03 10:21:02,366 [myid:] - INFO  [NIOServerCxnFactory.AcceptThread:0.0.0.0/0.0.0.0:11221:NIOServerCnxnFactory$AcceptThread@296]
- Accepted socket connection from /127.0.0.1:46925
    [junit] 2015-05-03 10:21:02,367 [myid:] - INFO  [NIOWorkerThread-1:NIOServerCnxn@836]
- Processing stat command from /127.0.0.1:46925
    [junit] 2015-05-03 10:21:02,367 [myid:] - INFO  [NIOWorkerThread-1:NIOServerCnxn$StatCommand@685]
- Stat command output
    [junit] 2015-05-03 10:21:02,368 [myid:] - INFO  [NIOWorkerThread-1:NIOServerCnxn@1007]
- Closed socket connection for client /127.0.0.1:46925 (no session established for client)
    [junit] 2015-05-03 10:21:02,368 [myid:] - INFO  [main:JMXEnv@224] - ensureParent:[InMemoryDataTree,
StandaloneServer_port]
    [junit] 2015-05-03 10:21:02,370 [myid:] - INFO  [main:JMXEnv@241] - expect:InMemoryDataTree
    [junit] 2015-05-03 10:21:02,370 [myid:] - INFO  [main:JMXEnv@245] - found:InMemoryDataTree
org.apache.ZooKeeperService:name0=StandaloneServer_port11221,name1=InMemoryDataTree
    [junit] 2015-05-03 10:21:02,370 [myid:] - INFO  [main:JMXEnv@241] - expect:StandaloneServer_port
    [junit] 2015-05-03 10:21:02,370 [myid:] - INFO  [main:JMXEnv@245] - found:StandaloneServer_port
org.apache.ZooKeeperService:name0=StandaloneServer_port11221
    [junit] 2015-05-03 10:21:02,370 [myid:] - INFO  [main:JUnit4ZKTestRunner$LoggedInvokeMethod@55]
- Memory used 18132
    [junit] 2015-05-03 10:21:02,371 [myid:] - INFO  [main:JUnit4ZKTestRunner$LoggedInvokeMethod@60]
- Number of threads 24
    [junit] 2015-05-03 10:21:02,371 [myid:] - INFO  [main:JUnit4ZKTestRunner$LoggedInvokeMethod@65]
- FINISHED TEST METHOD testQuota
    [junit] 2015-05-03 10:21:02,371 [myid:] - INFO  [main:ClientBase@538] - tearDown starting
    [junit] 2015-05-03 10:21:02,439 [myid:] - INFO  [main:ZooKeeper@1111] - Session: 0x10441a113710000
closed
    [junit] 2015-05-03 10:21:02,439 [myid:] - INFO  [main:ClientBase@508] - STOPPING server
    [junit] 2015-05-03 10:21:02,439 [myid:] - INFO  [main-EventThread:ClientCnxn$EventThread@531]
- EventThread shut down
    [junit] 2015-05-03 10:21:02,440 [myid:] - INFO  [ConnnectionExpirer:NIOServerCnxnFactory$ConnectionExpirerThread@583]
- ConnnectionExpirerThread interrupted
    [junit] 2015-05-03 10:21:02,440 [myid:] - INFO  [NIOServerCxnFactory.SelectorThread-1:NIOServerCnxnFactory$SelectorThread@420]
- selector thread exitted run method
    [junit] 2015-05-03 10:21:02,440 [myid:] - INFO  [NIOServerCxnFactory.SelectorThread-0:NIOServerCnxnFactory$SelectorThread@420]
- selector thread exitted run method
    [junit] 2015-05-03 10:21:02,440 [myid:] - INFO  [NIOServerCxnFactory.AcceptThread:0.0.0.0/0.0.0.0:11221:NIOServerCnxnFactory$AcceptThread@219]
- accept thread exitted run method
    [junit] 2015-05-03 10:21:02,440 [myid:] - INFO  [main:ZooKeeperServer@465] - shutting
down
    [junit] 2015-05-03 10:21:02,441 [myid:] - INFO  [main:SessionTrackerImpl@232] - Shutting
down
    [junit] 2015-05-03 10:21:02,441 [myid:] - INFO  [main:PrepRequestProcessor@973] - Shutting
down
    [junit] 2015-05-03 10:21:02,441 [myid:] - INFO  [main:SyncRequestProcessor@191] - Shutting
down
    [junit] 2015-05-03 10:21:02,441 [myid:] - INFO  [ProcessThread(sid:0 cport:11221)::PrepRequestProcessor@155]
- PrepRequestProcessor exited loop!
    [junit] 2015-05-03 10:21:02,446 [myid:] - INFO  [SyncThread:0:SyncRequestProcessor@169]
- SyncRequestProcessor exited!
    [junit] 2015-05-03 10:21:02,446 [myid:] - INFO  [main:FinalRequestProcessor@489] - shutdown
of request processor complete
    [junit] 2015-05-03 10:21:02,447 [myid:] - INFO  [main:MBeanRegistry@119] - Unregister
MBean [org.apache.ZooKeeperService:name0=StandaloneServer_port11221,name1=InMemoryDataTree]
    [junit] 2015-05-03 10:21:02,447 [myid:] - INFO  [main:MBeanRegistry@119] - Unregister
MBean [org.apache.ZooKeeperService:name0=StandaloneServer_port11221]
    [junit] 2015-05-03 10:21:02,447 [myid:] - INFO  [main:FourLetterWordMain@63] - connecting
to 127.0.0.1 11221
    [junit] 2015-05-03 10:21:02,448 [myid:] - INFO  [main:JMXEnv@142] - ensureOnly:[]
    [junit] 2015-05-03 10:21:02,453 [myid:] - INFO  [main:ClientBase@563] - fdcount after
test is: 47 at start it was 33
    [junit] 2015-05-03 10:21:02,453 [myid:] - INFO  [main:ClientBase@565] - sleeping for 20
secs
    [junit] 2015-05-03 10:21:02,454 [myid:] - INFO  [main:ZKTestCase$1@65] - SUCCEEDED testQuota
    [junit] 2015-05-03 10:21:02,455 [myid:] - INFO  [main:ZKTestCase$1@60] - FINISHED testQuota
    [junit] Tests run: 1, Failures: 0, Errors: 0, Skipped: 0, Time elapsed: 0.559 sec

BUILD FAILED
/home/jenkins/jenkins-slave/workspace/ZooKeeper_branch35_jdk7/branch-3.5/build.xml:1428: The
following error occurred while executing this line:
/home/jenkins/jenkins-slave/workspace/ZooKeeper_branch35_jdk7/branch-3.5/build.xml:1339: Tests
failed!

Total time: 43 minutes 37 seconds
Build step 'Invoke Ant' marked build as failure
Archiving artifacts
Recording test results
Email was triggered for: Failure
Sending email for trigger: Failure



###################################################################################
############################## FAILED TESTS (if any) ##############################
1 tests failed.
REGRESSION:  org.apache.zookeeper.test.ClientPortBindTest.testBindByAddress

Error Message:
No such device

Stack Trace:
java.net.SocketException: No such device
	at java.net.NetworkInterface.isLoopback0(Native Method)
	at java.net.NetworkInterface.isLoopback(NetworkInterface.java:390)
	at org.apache.zookeeper.test.ClientPortBindTest.testBindByAddress(ClientPortBindTest.java:61)
	at org.apache.zookeeper.JUnit4ZKTestRunner$LoggedInvokeMethod.evaluate(JUnit4ZKTestRunner.java:52)



Mime
  • Unnamed multipart/mixed (inline, None, 0 bytes)
View raw message