zookeeper-dev mailing list archives

Site index · List index
Message view « Date » · « Thread »
Top « Date » · « Thread »
From Apache Jenkins Server <jenk...@builds.apache.org>
Subject Failed: ZOOKEEPER-1077 PreCommit Build #2668
Date Fri, 01 May 2015 20:21:25 GMT
Jira: https://issues.apache.org/jira/browse/ZOOKEEPER-1077
Build: https://builds.apache.org/job/PreCommit-ZOOKEEPER-Build/2668/

###################################################################################
########################## LAST 60 LINES OF THE CONSOLE ###########################
[...truncated 97 lines...]
     [exec] 2 out of 2 hunks FAILED -- saving rejects to file src/c/src/zk_log.c.rej
     [exec] patching file src/c/tests/LibCMocks.cc
     [exec] Hunk #1 succeeded at 148 (offset 1 line).
     [exec] patching file src/c/tests/wrappers.opt
     [exec] PATCH APPLICATION FAILED
     [exec] 
     [exec] 
     [exec] 
     [exec] 
     [exec] -1 overall.  Here are the results of testing the latest attachment 
     [exec]   http://issues.apache.org/jira/secure/attachment/12729828/ZOOKEEPER-1077-branch-3.4.002.patch
     [exec]   against trunk revision 1676359.
     [exec] 
     [exec]     +1 @author.  The patch does not contain any @author tags.
     [exec] 
     [exec]     +1 tests included.  The patch appears to include 15 new or modified tests.
     [exec] 
     [exec]     -1 patch.  The patch command could not apply the patch.
     [exec] 
     [exec] Console output: https://builds.apache.org/job/PreCommit-ZOOKEEPER-Build/2668//console
     [exec] 
     [exec] This message is automatically generated.
     [exec] 
     [exec] 
     [exec] ======================================================================
     [exec] ======================================================================
     [exec]     Adding comment to Jira.
     [exec] ======================================================================
     [exec] ======================================================================
     [exec] 
     [exec] 
     [exec] Comment added.
     [exec] 9ff6aa97d74c5787dbb0b5b700d1b4f791753e5d logged out
     [exec] 
     [exec] 
     [exec] ======================================================================
     [exec] ======================================================================
     [exec]     Finished build.
     [exec] ======================================================================
     [exec] ======================================================================
     [exec] 
     [exec] 

BUILD FAILED
/home/jenkins/jenkins-slave/workspace/PreCommit-ZOOKEEPER-Build/trunk/build.xml:1721: exec
returned: 1

Total time: 45 seconds
Build step 'Execute shell' marked build as failure
Archiving artifacts
Sending artifact delta relative to PreCommit-ZOOKEEPER-Build #2660
Archived 1 artifacts
Archive block size is 32768
Received 0 blocks and 60640 bytes
Compression is 0.0%
Took 3.5 sec
Recording test results
Description set: ZOOKEEPER-1077
Email was triggered for: Failure
Sending email for trigger: Failure



###################################################################################
############################## FAILED TESTS (if any) ##############################
No tests ran.
Mime
  • Unnamed multipart/mixed (inline, None, 0 bytes)
View raw message