zookeeper-dev mailing list archives

Site index · List index
Message view « Date » · « Thread »
Top « Date » · « Thread »
From Apache Jenkins Server <jenk...@builds.apache.org>
Subject Failed: ZOOKEEPER-2192 PreCommit Build #2705
Date Tue, 19 May 2015 17:41:18 GMT
Jira: https://issues.apache.org/jira/browse/ZOOKEEPER-2192
Build: https://builds.apache.org/job/PreCommit-ZOOKEEPER-Build/2705/

###################################################################################
########################## LAST 60 LINES OF THE CONSOLE ###########################
[...truncated 372 lines...]
     [exec] File to patch: 
     [exec] Skip this patch? [y] 
     [exec] Skipping patch.
     [exec] 1 out of 1 hunk ignored
     [exec] PATCH APPLICATION FAILED
     [exec] 
     [exec] 
     [exec] 
     [exec] 
     [exec] -1 overall.  Here are the results of testing the latest attachment 
     [exec]   http://issues.apache.org/jira/secure/attachment/12733880/ZOOKEEPER-2192.patch
     [exec]   against trunk revision 1679951.
     [exec] 
     [exec]     +1 @author.  The patch does not contain any @author tags.
     [exec] 
     [exec]     +1 tests included.  The patch appears to include 6 new or modified tests.
     [exec] 
     [exec]     -1 patch.  The patch command could not apply the patch.
     [exec] 
     [exec] Console output: https://builds.apache.org/job/PreCommit-ZOOKEEPER-Build/2705//console
     [exec] 
     [exec] This message is automatically generated.
     [exec] 
     [exec] 
     [exec] ======================================================================
     [exec] ======================================================================
     [exec]     Adding comment to Jira.
     [exec] ======================================================================
     [exec] ======================================================================
     [exec] 
     [exec] 
     [exec] Comment added.
     [exec] 874cebb3534455da58af26e400595f87e1273825 logged out
     [exec] 
     [exec] 
     [exec] ======================================================================
     [exec] ======================================================================
     [exec]     Finished build.
     [exec] ======================================================================
     [exec] ======================================================================
     [exec] 
     [exec] 

BUILD FAILED
/home/jenkins/jenkins-slave/workspace/PreCommit-ZOOKEEPER-Build/trunk/build.xml:1735: exec
returned: 1

Total time: 40 seconds
Build step 'Execute shell' marked build as failure
Archiving artifacts
Sending artifact delta relative to PreCommit-ZOOKEEPER-Build #2703
Archived 1 artifacts
Archive block size is 32768
Received 0 blocks and 60816 bytes
Compression is 0.0%
Took 6.7 sec
Recording test results
Description set: ZOOKEEPER-2192
Email was triggered for: Failure
Sending email for trigger: Failure



###################################################################################
############################## FAILED TESTS (if any) ##############################
No tests ran.
Mime
  • Unnamed multipart/mixed (inline, None, 0 bytes)
View raw message