zookeeper-dev mailing list archives

Site index · List index
Message view « Date » · « Thread »
Top « Date » · « Thread »
From Apache Jenkins Server <jenk...@builds.apache.org>
Subject ZooKeeper-trunk-WinVS2008 - Build # 1790 - Still Failing
Date Wed, 06 May 2015 08:30:50 GMT
See https://builds.apache.org/job/ZooKeeper-trunk-WinVS2008/1790/

###################################################################################
########################## LAST 60 LINES OF THE CONSOLE ###########################
[...truncated 111 lines...]
   [javacc] File "SimpleCharStream.java" does not exist.  Will create one.
   [javacc] Parser generated successfully.

jute:
    [javac] Compiling 39 source files to f:\hudson\hudson-slave\workspace\ZooKeeper-trunk-WinVS2008\trunk\build\classes

compile_jute_uptodate:

compile_jute:
    [mkdir] Created dir: f:\hudson\hudson-slave\workspace\ZooKeeper-trunk-WinVS2008\trunk\src\java\generated
    [mkdir] Created dir: f:\hudson\hudson-slave\workspace\ZooKeeper-trunk-WinVS2008\trunk\src\c\generated
     [java] ../../zookeeper.jute Parsed Successfully
     [java] ../../zookeeper.jute Parsed Successfully
    [touch] Creating f:\hudson\hudson-slave\workspace\ZooKeeper-trunk-WinVS2008\trunk\src\java\generated\.generated

BUILD SUCCESSFUL
Total time: 10 seconds
[ZooKeeper-trunk-WinVS2008] $ cmd /c call C:\Windows\TEMP\hudson2973866653873007127.bat

f:\hudson\hudson-slave\workspace\ZooKeeper-trunk-WinVS2008>set ZOOKEEPER_HOME=f:\hudson\hudson-slave\workspace\ZooKeeper-trunk-WinVS2008\trunk


f:\hudson\hudson-slave\workspace\ZooKeeper-trunk-WinVS2008>msbuild trunk/src/c/zookeeper.sln
/p:Configuration=Release 
Microsoft (R) Build Engine version 4.0.30319.18408
[Microsoft .NET Framework, version 4.0.30319.18444]
Copyright (C) Microsoft Corporation. All rights reserved.

Building the projects in this solution one at a time. To enable parallel build, please add
the "/m" switch.
Build started 5/6/2015 9:22:37 AM.
Project "f:\hudson\hudson-slave\workspace\ZooKeeper-trunk-WinVS2008\trunk\src\c\zookeeper.sln"
on node 1 (default targets).
ValidateSolutionConfiguration:
  Building solution configuration "Release|Win32".
zookeeper:
  C:\Program Files (x86)\Microsoft Visual Studio 9.0\Common7\IDE\..\..\vc\vcpackages\VCBuild.exe
f:\hudson\hudson-slave\workspace\ZooKeeper-trunk-WinVS2008\trunk\src\c\zookeeper.vcproj "Release|Win32"

cl : Command line warning D9035: option 'Wp64' has been deprecated and will be removed in
a future release [f:\hudson\hudson-slave\workspace\ZooKeeper-trunk-WinVS2008\trunk\src\c\zookeeper.sln]
.\src\zookeeper.c(43): fatal error C1083: Cannot open include file: 'unistd.h': No such file
or directory [f:\hudson\hudson-slave\workspace\ZooKeeper-trunk-WinVS2008\trunk\src\c\zookeeper.sln]
Cli:
  C:\Program Files (x86)\Microsoft Visual Studio 9.0\Common7\IDE\..\..\vc\vcpackages\VCBuild.exe
f:\hudson\hudson-slave\workspace\ZooKeeper-trunk-WinVS2008\trunk\src\c\Cli.vcproj "Release|Win32"

Done Building Project "f:\hudson\hudson-slave\workspace\ZooKeeper-trunk-WinVS2008\trunk\src\c\zookeeper.sln"
(default targets) -- FAILED.

Build FAILED.

"f:\hudson\hudson-slave\workspace\ZooKeeper-trunk-WinVS2008\trunk\src\c\zookeeper.sln" (default
target) (1) ->
(zookeeper target) -> 
  cl : Command line warning D9035: option 'Wp64' has been deprecated and will be removed in
a future release [f:\hudson\hudson-slave\workspace\ZooKeeper-trunk-WinVS2008\trunk\src\c\zookeeper.sln]


"f:\hudson\hudson-slave\workspace\ZooKeeper-trunk-WinVS2008\trunk\src\c\zookeeper.sln" (default
target) (1) ->
(zookeeper target) -> 
  .\src\zookeeper.c(43): fatal error C1083: Cannot open include file: 'unistd.h': No such
file or directory [f:\hudson\hudson-slave\workspace\ZooKeeper-trunk-WinVS2008\trunk\src\c\zookeeper.sln]

    1 Warning(s)
    1 Error(s)

Time Elapsed 00:00:08.49

f:\hudson\hudson-slave\workspace\ZooKeeper-trunk-WinVS2008>exit 1 
Build step 'Execute Windows batch command' marked build as failure
Email was triggered for: Failure
Sending email for trigger: Failure



###################################################################################
############################## FAILED TESTS (if any) ##############################
No tests ran.
Mime
  • Unnamed multipart/mixed (inline, None, 0 bytes)
View raw message