zookeeper-dev mailing list archives

Site index · List index
Message view « Date » · « Thread »
Top « Date » · « Thread »
From "Patrick Hunt (JIRA)" <j...@apache.org>
Subject [jira] [Commented] (ZOOKEEPER-1430) add maven deploy support to the build
Date Sat, 02 Nov 2013 15:36:19 GMT

    [ https://issues.apache.org/jira/browse/ZOOKEEPER-1430?page=com.atlassian.jira.plugin.system.issuetabpanels:comment-tabpanel&focusedCommentId=13812029#comment-13812029
] 

Patrick Hunt commented on ZOOKEEPER-1430:
-----------------------------------------

[~gkesavan] I applied the patch to 3.4 branch (minor conflict, see attachment) but it fails
when running mvn-deploy as follows: (I did not try running with trunk)

{noformat}
[artifact:mvn] [INFO] ------------------------------------------------------------------------
[artifact:mvn] [ERROR] BUILD FAILURE
[artifact:mvn] [INFO] ------------------------------------------------------------------------
[artifact:mvn] [INFO] Invalid task '': you must specify a valid lifecycle phase, or a goal
in the format plugin:goal or pluginGroupId:pluginArtifactId:pluginVersion:goal
[artifact:mvn] [INFO] ------------------------------------------------------------------------
[artifact:mvn] [INFO] For more information, run Maven with the -e switch
[artifact:mvn] [INFO] ------------------------------------------------------------------------
[artifact:mvn] [INFO] Total time: 50 seconds
[artifact:mvn] [INFO] Finished at: Sat Nov 02 08:30:38 PDT 2013
[artifact:mvn] [INFO] Final Memory: 32M/351M
[artifact:mvn] [INFO] ------------------------------------------------------------------------
[artifact:mvn] Java Result: 1
[artifact:mvn] [INFO] Scanning for projects...
[artifact:mvn] [INFO] ------------------------------------------------------------------------
[artifact:mvn] [ERROR] BUILD FAILURE
[artifact:mvn] [INFO] ------------------------------------------------------------------------
[artifact:mvn] [INFO] Invalid task '': you must specify a valid lifecycle phase, or a goal
in the format plugin:goal or pluginGroupId:pluginArtifactId:pluginVersion:goal
[artifact:mvn] [INFO] ------------------------------------------------------------------------
[artifact:mvn] [INFO] For more information, run Maven with the -e switch
[artifact:mvn] [INFO] ------------------------------------------------------------------------
[artifact:mvn] [INFO] Total time: < 1 second
[artifact:mvn] [INFO] Finished at: Sat Nov 02 08:30:39 PDT 2013
[artifact:mvn] [INFO] Final Memory: 32M/352M
[artifact:mvn] [INFO] ------------------------------------------------------------------------
[artifact:mvn] Java Result: 1
[artifact:mvn] [INFO] Scanning for projects...
[artifact:mvn] [INFO] ------------------------------------------------------------------------
[artifact:mvn] [ERROR] BUILD FAILURE
[artifact:mvn] [INFO] ------------------------------------------------------------------------
[artifact:mvn] [INFO] Invalid task '': you must specify a valid lifecycle phase, or a goal
in the format plugin:goal or pluginGroupId:pluginArtifactId:pluginVersion:goal
[artifact:mvn] [INFO] ------------------------------------------------------------------------
[artifact:mvn] [INFO] For more information, run Maven with the -e switch
[artifact:mvn] [INFO] ------------------------------------------------------------------------
[artifact:mvn] [INFO] Total time: < 1 second
[artifact:mvn] [INFO] Finished at: Sat Nov 02 08:30:40 PDT 2013
[artifact:mvn] [INFO] Final Memory: 33M/352M
[artifact:mvn] [INFO] ------------------------------------------------------------------------
[artifact:mvn] Java Result: 1
[artifact:mvn] [INFO] Scanning for projects...
[artifact:mvn] [INFO] ------------------------------------------------------------------------
[artifact:mvn] [ERROR] BUILD FAILURE
[artifact:mvn] [INFO] ------------------------------------------------------------------------
[artifact:mvn] [INFO] Invalid task '': you must specify a valid lifecycle phase, or a goal
in the format plugin:goal or pluginGroupId:pluginArtifactId:pluginVersion:goal
[artifact:mvn] [INFO] ------------------------------------------------------------------------
[artifact:mvn] [INFO] For more information, run Maven with the -e switch
[artifact:mvn] [INFO] ------------------------------------------------------------------------
[artifact:mvn] [INFO] Total time: < 1 second
[artifact:mvn] [INFO] Finished at: Sat Nov 02 08:30:41 PDT 2013
[artifact:mvn] [INFO] Final Memory: 33M/342M
[artifact:mvn] [INFO] ------------------------------------------------------------------------
[artifact:mvn] Java Result: 1
{noformat}

> add maven deploy support to the build
> -------------------------------------
>
>                 Key: ZOOKEEPER-1430
>                 URL: https://issues.apache.org/jira/browse/ZOOKEEPER-1430
>             Project: ZooKeeper
>          Issue Type: Task
>          Components: build
>    Affects Versions: 3.4.4, 3.5.0
>            Reporter: Patrick Hunt
>            Assignee: Giridharan Kesavan
>            Priority: Blocker
>             Fix For: 3.4.6, 3.5.0
>
>         Attachments: ZOOKEEPER-1430-3.4.patch, ZOOKEEPER-1430-V1.PATCH, ZOOKEEPER-1430-V2.PATCH,
ZOOKEEPER-1430-V3.patch, ZOOKEEPER-1430.patch, ZOOKEEPER-1430.patch
>
>
> Infra is phasing out the current mechanism we use to deploy maven artifacts. We need
to move to repository.apache.org (nexus).
> In particular we need to ensure the following artifacts get published:
> * zookeeper-3.x.y.jar
> * zookeeper-3.x.y-sources.jar
> * zookeeper-3.x.y-tests.jar
> * zookeeper-3.x.y-javadoc.jar
> In 3.4.4/3.4.5 we missed the tests jar which caused headaches for downstream users, such
as Hadoop.



--
This message was sent by Atlassian JIRA
(v6.1#6144)

Mime
View raw message