zookeeper-dev mailing list archives

Site index · List index
Message view « Date » · « Thread »
Top « Date » · « Thread »
From Apache Jenkins Server <jenk...@builds.apache.org>
Subject Failed: ZOOKEEPER-1666 PreCommit Build #1743
Date Tue, 05 Nov 2013 05:03:22 GMT
Jira: https://issues.apache.org/jira/browse/ZOOKEEPER-1666
Build: https://builds.apache.org/job/PreCommit-ZOOKEEPER-Build/1743/

###################################################################################
########################## LAST 60 LINES OF THE CONSOLE ###########################
[...truncated 68 lines...]
     [exec] ======================================================================
     [exec] 
     [exec] 
     [exec] patching file src/java/test/org/apache/zookeeper/test/StaticHostProviderTest.java
     [exec] Hunk #1 FAILED at 35.
     [exec] Hunk #2 succeeded at 301 with fuzz 1 (offset 209 lines).
     [exec] 1 out of 2 hunks FAILED -- saving rejects to file src/java/test/org/apache/zookeeper/test/StaticHostProviderTest.java.rej
     [exec] patching file src/java/main/org/apache/zookeeper/client/StaticHostProvider.java
     [exec] Hunk #1 FAILED at 56.
     [exec] 1 out of 1 hunk FAILED -- saving rejects to file src/java/main/org/apache/zookeeper/client/StaticHostProvider.java.rej
     [exec] PATCH APPLICATION FAILED
     [exec] 
     [exec] 
     [exec] 
     [exec] 
     [exec] -1 overall.  Here are the results of testing the latest attachment 
     [exec]   http://issues.apache.org/jira/secure/attachment/12612093/ZOOKEEPER-1666-34.patch
     [exec]   against trunk revision 1538853.
     [exec] 
     [exec]     +1 @author.  The patch does not contain any @author tags.
     [exec] 
     [exec]     +1 tests included.  The patch appears to include 3 new or modified tests.
     [exec] 
     [exec]     -1 patch.  The patch command could not apply the patch.
     [exec] 
     [exec] Console output: https://builds.apache.org/job/PreCommit-ZOOKEEPER-Build/1743//console
     [exec] 
     [exec] This message is automatically generated.
     [exec] 
     [exec] 
     [exec] ======================================================================
     [exec] ======================================================================
     [exec]     Adding comment to Jira.
     [exec] ======================================================================
     [exec] ======================================================================
     [exec] 
     [exec] 
     [exec] Comment added.
     [exec] feef8621728acce1af4f17c9cd65d22bf710ec7c logged out
     [exec] 
     [exec] 
     [exec] ======================================================================
     [exec] ======================================================================
     [exec]     Finished build.
     [exec] ======================================================================
     [exec] ======================================================================
     [exec] 
     [exec] 

BUILD FAILED
/home/jenkins/jenkins-slave/workspace/PreCommit-ZOOKEEPER-Build/trunk/build.xml:1623: exec
returned: 1

Total time: 1 minute 26 seconds
Build step 'Execute shell' marked build as failure
Archiving artifacts
Recording test results
Description set: ZOOKEEPER-1666
Email was triggered for: Failure
Sending email for trigger: Failure



###################################################################################
############################## FAILED TESTS (if any) ##############################
No tests ran.
Mime
  • Unnamed multipart/mixed (inline, None, 0 bytes)
View raw message