zookeeper-dev mailing list archives

Site index · List index
Message view « Date » · « Thread »
Top « Date » · « Thread »
From Apache Jenkins Server <jenk...@builds.apache.org>
Subject Failed: ZOOKEEPER-1808 PreCommit Build #1748
Date Thu, 07 Nov 2013 13:42:38 GMT
Jira: https://issues.apache.org/jira/browse/ZOOKEEPER-1808
Build: https://builds.apache.org/job/PreCommit-ZOOKEEPER-Build/1748/

###################################################################################
########################## LAST 60 LINES OF THE CONSOLE ###########################
[...truncated 97 lines...]
     [exec] Apply anyway? [n] 
     [exec] Skipping patch.
     [exec] 1 out of 1 hunk ignored -- saving rejects to file src/java/test/org/apache/zookeeper/test/FLELostMessageTest.java.rej
     [exec] patching file src/java/test/org/apache/zookeeper/test/FLETestUtils.java
     [exec] Reversed (or previously applied) patch detected!  Assume -R? [n] 
     [exec] Apply anyway? [n] 
     [exec] Skipping patch.
     [exec] 1 out of 1 hunk ignored -- saving rejects to file src/java/test/org/apache/zookeeper/test/FLETestUtils.java.rej
     [exec] patching file src/java/test/org/apache/zookeeper/test/LENonTerminateTest.java
     [exec] Hunk #1 succeeded at 37 (offset -1 lines).
     [exec] PATCH APPLICATION FAILED
     [exec] 
     [exec] 
     [exec] 
     [exec] 
     [exec] -1 overall.  Here are the results of testing the latest attachment 
     [exec]   http://issues.apache.org/jira/secure/attachment/12612600/ZOOKEEPER-1808.patch
     [exec]   against trunk revision 1539529.
     [exec] 
     [exec]     +1 @author.  The patch does not contain any @author tags.
     [exec] 
     [exec]     +1 tests included.  The patch appears to include 21 new or modified tests.
     [exec] 
     [exec]     -1 patch.  The patch command could not apply the patch.
     [exec] 
     [exec] Console output: https://builds.apache.org/job/PreCommit-ZOOKEEPER-Build/1748//console
     [exec] 
     [exec] This message is automatically generated.
     [exec] 
     [exec] 
     [exec] ======================================================================
     [exec] ======================================================================
     [exec]     Adding comment to Jira.
     [exec] ======================================================================
     [exec] ======================================================================
     [exec] 
     [exec] 
     [exec] Comment added.
     [exec] 8f65f4e62bdf5155ae4e95fe06ad2120c6f0bf13 logged out
     [exec] 
     [exec] 
     [exec] ======================================================================
     [exec] ======================================================================
     [exec]     Finished build.
     [exec] ======================================================================
     [exec] ======================================================================
     [exec] 
     [exec] 

BUILD FAILED
/home/jenkins/jenkins-slave/workspace/PreCommit-ZOOKEEPER-Build/trunk/build.xml:1623: exec
returned: 1

Total time: 1 minute 18 seconds
Build step 'Execute shell' marked build as failure
Archiving artifacts
Recording test results
Description set: ZOOKEEPER-1808
Email was triggered for: Failure
Sending email for trigger: Failure



###################################################################################
############################## FAILED TESTS (if any) ##############################
No tests ran.
Mime
  • Unnamed multipart/mixed (inline, None, 0 bytes)
View raw message