zookeeper-dev mailing list archives

Site index · List index
Message view « Date » · « Thread »
Top « Date » · « Thread »
From Apache Jenkins Server <jenk...@builds.apache.org>
Subject ZooKeeper-trunk-solaris - Build # 734 - Still Failing
Date Mon, 18 Nov 2013 13:00:51 GMT
See https://builds.apache.org/job/ZooKeeper-trunk-solaris/734/

###################################################################################
########################## LAST 60 LINES OF THE CONSOLE ###########################
[...truncated 198985 lines...]
    [junit] 2013-11-18 12:54:40,339 [myid:] - INFO  [NIOServerCxnFactory.SelectorThread-0:NIOServerCnxnFactory$SelectorThread@420]
- selector thread exitted run method
    [junit] 2013-11-18 12:54:40,339 [myid:] - INFO  [main:ZooKeeperServer@428] - shutting
down
    [junit] 2013-11-18 12:54:40,340 [myid:] - INFO  [main:SessionTrackerImpl@183] - Shutting
down
    [junit] 2013-11-18 12:54:40,340 [myid:] - INFO  [main:PrepRequestProcessor@972] - Shutting
down
    [junit] 2013-11-18 12:54:40,341 [myid:] - INFO  [main:SyncRequestProcessor@190] - Shutting
down
    [junit] 2013-11-18 12:54:40,341 [myid:] - INFO  [ProcessThread(sid:0 cport:-1)::PrepRequestProcessor@156]
- PrepRequestProcessor exited loop!
    [junit] 2013-11-18 12:54:40,341 [myid:] - INFO  [SyncThread:0:SyncRequestProcessor@168]
- SyncRequestProcessor exited!
    [junit] 2013-11-18 12:54:40,341 [myid:] - INFO  [main:FinalRequestProcessor@442] - shutdown
of request processor complete
    [junit] 2013-11-18 12:54:40,342 [myid:] - INFO  [main:FourLetterWordMain@43] - connecting
to 127.0.0.1 11221
    [junit] 2013-11-18 12:54:40,342 [myid:] - INFO  [main:JMXEnv@133] - ensureOnly:[]
    [junit] 2013-11-18 12:54:40,344 [myid:] - INFO  [main:ClientBase@414] - STARTING server
    [junit] 2013-11-18 12:54:40,344 [myid:] - INFO  [main:ZooKeeperServer@149] - Created server
with tickTime 3000 minSessionTimeout 6000 maxSessionTimeout 60000 datadir /zonestorage/hudson_solaris/home/hudson/hudson-slave/workspace/ZooKeeper-trunk-solaris/trunk/build/test/tmp/test3277501633421948805.junit.dir/version-2
snapdir /zonestorage/hudson_solaris/home/hudson/hudson-slave/workspace/ZooKeeper-trunk-solaris/trunk/build/test/tmp/test3277501633421948805.junit.dir/version-2
    [junit] 2013-11-18 12:54:40,345 [myid:] - INFO  [main:NIOServerCnxnFactory@670] - Configuring
NIO connection handler with 10s sessionless connection timeout, 2 selector thread(s), 16 worker
threads, and 64 kB direct buffers.
    [junit] 2013-11-18 12:54:40,345 [myid:] - INFO  [main:NIOServerCnxnFactory@683] - binding
to port 0.0.0.0/0.0.0.0:11221
    [junit] 2013-11-18 12:54:40,346 [myid:] - INFO  [main:FileSnap@83] - Reading snapshot
/zonestorage/hudson_solaris/home/hudson/hudson-slave/workspace/ZooKeeper-trunk-solaris/trunk/build/test/tmp/test3277501633421948805.junit.dir/version-2/snapshot.b
    [junit] 2013-11-18 12:54:40,349 [myid:] - INFO  [main:FileTxnSnapLog@297] - Snapshotting:
0xb to /zonestorage/hudson_solaris/home/hudson/hudson-slave/workspace/ZooKeeper-trunk-solaris/trunk/build/test/tmp/test3277501633421948805.junit.dir/version-2/snapshot.b
    [junit] 2013-11-18 12:54:40,350 [myid:] - INFO  [main:FourLetterWordMain@43] - connecting
to 127.0.0.1 11221
    [junit] 2013-11-18 12:54:40,351 [myid:] - INFO  [NIOServerCxnFactory.AcceptThread:0.0.0.0/0.0.0.0:11221:NIOServerCnxnFactory$AcceptThread@296]
- Accepted socket connection from /127.0.0.1:42905
    [junit] 2013-11-18 12:54:40,352 [myid:] - INFO  [NIOWorkerThread-1:NIOServerCnxn@828]
- Processing stat command from /127.0.0.1:42905
    [junit] 2013-11-18 12:54:40,352 [myid:] - INFO  [NIOWorkerThread-1:NIOServerCnxn$StatCommand@677]
- Stat command output
    [junit] 2013-11-18 12:54:40,353 [myid:] - INFO  [NIOWorkerThread-1:NIOServerCnxn@999]
- Closed socket connection for client /127.0.0.1:42905 (no session established for client)
    [junit] 2013-11-18 12:54:40,353 [myid:] - INFO  [main:JMXEnv@133] - ensureOnly:[InMemoryDataTree,
StandaloneServer_port]
    [junit] 2013-11-18 12:54:40,354 [myid:] - INFO  [main:JMXEnv@105] - expect:InMemoryDataTree
    [junit] 2013-11-18 12:54:40,354 [myid:] - INFO  [main:JMXEnv@108] - found:InMemoryDataTree
org.apache.ZooKeeperService:name0=StandaloneServer_port-1,name1=InMemoryDataTree
    [junit] 2013-11-18 12:54:40,355 [myid:] - INFO  [main:JMXEnv@105] - expect:StandaloneServer_port
    [junit] 2013-11-18 12:54:40,355 [myid:] - INFO  [main:JMXEnv@108] - found:StandaloneServer_port
org.apache.ZooKeeperService:name0=StandaloneServer_port-1
    [junit] 2013-11-18 12:54:40,355 [myid:] - INFO  [main:JUnit4ZKTestRunner$LoggedInvokeMethod@57]
- FINISHED TEST METHOD testQuota
    [junit] 2013-11-18 12:54:40,355 [myid:] - INFO  [main:ClientBase@451] - tearDown starting
    [junit] 2013-11-18 12:54:40,417 [myid:] - INFO  [main-EventThread:ClientCnxn$EventThread@513]
- EventThread shut down
    [junit] 2013-11-18 12:54:40,417 [myid:] - INFO  [main:ZooKeeper@777] - Session: 0x1426b46ee960000
closed
    [junit] 2013-11-18 12:54:40,417 [myid:] - INFO  [main:ClientBase@421] - STOPPING server
    [junit] 2013-11-18 12:54:40,418 [myid:] - INFO  [NIOServerCxnFactory.AcceptThread:0.0.0.0/0.0.0.0:11221:NIOServerCnxnFactory$AcceptThread@219]
- accept thread exitted run method
    [junit] 2013-11-18 12:54:40,418 [myid:] - INFO  [NIOServerCxnFactory.SelectorThread-1:NIOServerCnxnFactory$SelectorThread@420]
- selector thread exitted run method
    [junit] 2013-11-18 12:54:40,418 [myid:] - INFO  [NIOServerCxnFactory.SelectorThread-0:NIOServerCnxnFactory$SelectorThread@420]
- selector thread exitted run method
    [junit] 2013-11-18 12:54:40,419 [myid:] - INFO  [main:ZooKeeperServer@428] - shutting
down
    [junit] 2013-11-18 12:54:40,419 [myid:] - INFO  [main:SessionTrackerImpl@183] - Shutting
down
    [junit] 2013-11-18 12:54:40,419 [myid:] - INFO  [main:PrepRequestProcessor@972] - Shutting
down
    [junit] 2013-11-18 12:54:40,419 [myid:] - INFO  [main:SyncRequestProcessor@190] - Shutting
down
    [junit] 2013-11-18 12:54:40,419 [myid:] - INFO  [ProcessThread(sid:0 cport:-1)::PrepRequestProcessor@156]
- PrepRequestProcessor exited loop!
    [junit] 2013-11-18 12:54:40,420 [myid:] - INFO  [SyncThread:0:SyncRequestProcessor@168]
- SyncRequestProcessor exited!
    [junit] 2013-11-18 12:54:40,420 [myid:] - INFO  [main:FinalRequestProcessor@442] - shutdown
of request processor complete
    [junit] 2013-11-18 12:54:40,420 [myid:] - INFO  [main:FourLetterWordMain@43] - connecting
to 127.0.0.1 11221
    [junit] 2013-11-18 12:54:40,421 [myid:] - INFO  [main:JMXEnv@133] - ensureOnly:[]
    [junit] 2013-11-18 12:54:40,425 [myid:] - INFO  [main:ClientBase@476] - fdcount after
test is: 45 at start it was 31
    [junit] 2013-11-18 12:54:40,425 [myid:] - INFO  [main:ClientBase@478] - sleeping for 20
secs
    [junit] 2013-11-18 12:54:40,426 [myid:] - INFO  [main:ZKTestCase$1@61] - SUCCEEDED testQuota
    [junit] 2013-11-18 12:54:40,426 [myid:] - INFO  [main:ZKTestCase$1@56] - FINISHED testQuota
    [junit] Tests run: 1, Failures: 0, Errors: 0, Time elapsed: 0.87 sec

BUILD FAILED
/zonestorage/hudson_solaris/home/hudson/hudson-slave/workspace/ZooKeeper-trunk-solaris/trunk/build.xml:1264:
Tests failed!

Total time: 38 minutes 31 seconds
Build step 'Invoke Ant' marked build as failure
[locks-and-latches] Releasing all the locks
[locks-and-latches] All the locks released
Recording test results
Email was triggered for: Failure
Sending email for trigger: Failure



###################################################################################
############################## FAILED TESTS (if any) ##############################
14 tests failed.
REGRESSION:  org.apache.zookeeper.test.AsyncTest.testAsync

Error Message:
waiting for server up

Stack Trace:
junit.framework.AssertionFailedError: waiting for server up
	at org.apache.zookeeper.test.QuorumBase.startServers(QuorumBase.java:221)
	at org.apache.zookeeper.test.QuorumBase.setUp(QuorumBase.java:118)
	at org.apache.zookeeper.test.QuorumBase.setUp(QuorumBase.java:76)
	at org.apache.zookeeper.test.AsyncTest.setUp(AsyncTest.java:57)


REGRESSION:  org.apache.zookeeper.test.ChrootAsyncTest.testAsyncGetChildrenSingle

Error Message:
null

Stack Trace:
java.lang.NullPointerException
	at org.apache.zookeeper.test.AsyncOpsTest.tearDown(AsyncOpsTest.java:57)


REGRESSION:  org.apache.zookeeper.test.ChrootAsyncTest.testAsyncGetChildrenTwo

Error Message:
expected:<0> but was:<2>

Stack Trace:
junit.framework.AssertionFailedError: expected:<0> but was:<2>
	at org.apache.zookeeper.test.JMXEnv.ensureOnly(JMXEnv.java:138)
	at org.apache.zookeeper.test.ClientBase.stopServer(ClientBase.java:425)
	at org.apache.zookeeper.test.ClientBase.tearDown(ClientBase.java:455)
	at org.apache.zookeeper.test.AsyncOpsTest.tearDown(AsyncOpsTest.java:59)


REGRESSION:  org.apache.zookeeper.test.ChrootAsyncTest.testAsyncGetChildrenFailure_NoNode

Error Message:
expected:<0> but was:<2>

Stack Trace:
junit.framework.AssertionFailedError: expected:<0> but was:<2>
	at org.apache.zookeeper.test.JMXEnv.ensureOnly(JMXEnv.java:138)
	at org.apache.zookeeper.test.ClientBase.stopServer(ClientBase.java:425)
	at org.apache.zookeeper.test.ClientBase.tearDown(ClientBase.java:455)
	at org.apache.zookeeper.test.AsyncOpsTest.tearDown(AsyncOpsTest.java:59)


REGRESSION:  org.apache.zookeeper.test.ChrootAsyncTest.testAsyncGetChildren2Empty

Error Message:
expected:<0> but was:<2>

Stack Trace:
junit.framework.AssertionFailedError: expected:<0> but was:<2>
	at org.apache.zookeeper.test.JMXEnv.ensureOnly(JMXEnv.java:138)
	at org.apache.zookeeper.test.ClientBase.stopServer(ClientBase.java:425)
	at org.apache.zookeeper.test.ClientBase.tearDown(ClientBase.java:455)
	at org.apache.zookeeper.test.AsyncOpsTest.tearDown(AsyncOpsTest.java:59)


REGRESSION:  org.apache.zookeeper.test.ChrootAsyncTest.testAsyncGetChildren2Single

Error Message:
expected:<0> but was:<2>

Stack Trace:
junit.framework.AssertionFailedError: expected:<0> but was:<2>
	at org.apache.zookeeper.test.JMXEnv.ensureOnly(JMXEnv.java:138)
	at org.apache.zookeeper.test.ClientBase.stopServer(ClientBase.java:425)
	at org.apache.zookeeper.test.ClientBase.tearDown(ClientBase.java:455)
	at org.apache.zookeeper.test.AsyncOpsTest.tearDown(AsyncOpsTest.java:59)


REGRESSION:  org.apache.zookeeper.test.ChrootAsyncTest.testAsyncGetChildren2Two

Error Message:
expected:<0> but was:<2>

Stack Trace:
junit.framework.AssertionFailedError: expected:<0> but was:<2>
	at org.apache.zookeeper.test.JMXEnv.ensureOnly(JMXEnv.java:138)
	at org.apache.zookeeper.test.ClientBase.stopServer(ClientBase.java:425)
	at org.apache.zookeeper.test.ClientBase.tearDown(ClientBase.java:455)
	at org.apache.zookeeper.test.AsyncOpsTest.tearDown(AsyncOpsTest.java:59)


REGRESSION:  org.apache.zookeeper.test.ChrootAsyncTest.testAsyncGetChildren2Failure_NoNode

Error Message:
expected:<0> but was:<2>

Stack Trace:
junit.framework.AssertionFailedError: expected:<0> but was:<2>
	at org.apache.zookeeper.test.JMXEnv.ensureOnly(JMXEnv.java:138)
	at org.apache.zookeeper.test.ClientBase.stopServer(ClientBase.java:425)
	at org.apache.zookeeper.test.ClientBase.tearDown(ClientBase.java:455)
	at org.apache.zookeeper.test.AsyncOpsTest.tearDown(AsyncOpsTest.java:59)


REGRESSION:  org.apache.zookeeper.test.ChrootAsyncTest.testAsyncGetData

Error Message:
expected:<0> but was:<2>

Stack Trace:
junit.framework.AssertionFailedError: expected:<0> but was:<2>
	at org.apache.zookeeper.test.JMXEnv.ensureOnly(JMXEnv.java:138)
	at org.apache.zookeeper.test.ClientBase.stopServer(ClientBase.java:425)
	at org.apache.zookeeper.test.ClientBase.tearDown(ClientBase.java:455)
	at org.apache.zookeeper.test.AsyncOpsTest.tearDown(AsyncOpsTest.java:59)


REGRESSION:  org.apache.zookeeper.test.ChrootAsyncTest.testAsyncGetDataFailure_NoNode

Error Message:
expected:<0> but was:<2>

Stack Trace:
junit.framework.AssertionFailedError: expected:<0> but was:<2>
	at org.apache.zookeeper.test.JMXEnv.ensureOnly(JMXEnv.java:138)
	at org.apache.zookeeper.test.ClientBase.stopServer(ClientBase.java:425)
	at org.apache.zookeeper.test.ClientBase.tearDown(ClientBase.java:455)
	at org.apache.zookeeper.test.AsyncOpsTest.tearDown(AsyncOpsTest.java:59)


FAILED:  org.apache.zookeeper.test.FLETest.testTripleElection

Error Message:
Fewer than a a majority has joined

Stack Trace:
junit.framework.AssertionFailedError: Fewer than a a majority has joined
	at org.apache.zookeeper.test.FLETest.runElection(FLETest.java:355)
	at org.apache.zookeeper.test.FLETest.testTripleElection(FLETest.java:282)
	at org.apache.zookeeper.JUnit4ZKTestRunner$LoggedInvokeMethod.evaluate(JUnit4ZKTestRunner.java:52)


REGRESSION:  org.apache.zookeeper.test.AsyncHammerTest.testObserversHammer

Error Message:
thread HammerThread-9 still alive after join

Stack Trace:
junit.framework.AssertionFailedError: thread HammerThread-9 still alive after join
	at org.apache.zookeeper.test.ClientBase.verifyThreadTerminated(ClientBase.java:299)
	at org.apache.zookeeper.test.AsyncHammerTest.testObserversHammer(AsyncHammerTest.java:214)
	at org.apache.zookeeper.JUnit4ZKTestRunner$LoggedInvokeMethod.evaluate(JUnit4ZKTestRunner.java:52)


REGRESSION:  org.apache.zookeeper.test.QuorumZxidSyncTest.testBehindLeader

Error Message:
Servers didn't come up

Stack Trace:
junit.framework.AssertionFailedError: Servers didn't come up
	at org.apache.zookeeper.test.QuorumZxidSyncTest.testBehindLeader(QuorumZxidSyncTest.java:87)
	at org.apache.zookeeper.JUnit4ZKTestRunner$LoggedInvokeMethod.evaluate(JUnit4ZKTestRunner.java:52)


FAILED:  org.apache.zookeeper.test.ServerCnxnTest.testServerCnxnExpiry

Error Message:
Connection reset

Stack Trace:
java.net.SocketException: Connection reset
	at java.net.SocketInputStream.read(SocketInputStream.java:168)
	at sun.nio.cs.StreamDecoder.readBytes(StreamDecoder.java:264)
	at sun.nio.cs.StreamDecoder.implRead(StreamDecoder.java:306)
	at sun.nio.cs.StreamDecoder.read(StreamDecoder.java:158)
	at java.io.InputStreamReader.read(InputStreamReader.java:167)
	at java.io.BufferedReader.fill(BufferedReader.java:136)
	at java.io.BufferedReader.readLine(BufferedReader.java:299)
	at java.io.BufferedReader.readLine(BufferedReader.java:362)
	at org.apache.zookeeper.test.ServerCnxnTest.send4LetterWord(ServerCnxnTest.java:105)
	at org.apache.zookeeper.test.ServerCnxnTest.sendRequest(ServerCnxnTest.java:77)
	at org.apache.zookeeper.test.ServerCnxnTest.testServerCnxnExpiry(ServerCnxnTest.java:64)
	at org.apache.zookeeper.JUnit4ZKTestRunner$LoggedInvokeMethod.evaluate(JUnit4ZKTestRunner.java:52)



Mime
  • Unnamed multipart/mixed (inline, None, 0 bytes)
View raw message