zookeeper-dev mailing list archives

Site index · List index
Message view « Date » · « Thread »
Top « Date » · « Thread »
From Apache Jenkins Server <jenk...@builds.apache.org>
Subject ZooKeeper-3.4-WinVS2008_java - Build # 353 - Still Failing
Date Thu, 21 Nov 2013 10:19:24 GMT
See https://builds.apache.org/job/ZooKeeper-3.4-WinVS2008_java/353/

###################################################################################
########################## LAST 60 LINES OF THE CONSOLE ###########################
[...truncated 201128 lines...]
    [junit] 	at org.junit.runners.ParentRunner.access$000(ParentRunner.java:42)
    [junit] 	at org.junit.runners.ParentRunner$2.evaluate(ParentRunner.java:184)
    [junit] 	at org.junit.runners.ParentRunner.run(ParentRunner.java:236)
    [junit] 	at junit.framework.JUnit4TestAdapter.run(JUnit4TestAdapter.java:39)
    [junit] 	at org.apache.tools.ant.taskdefs.optional.junit.JUnitTestRunner.run(JUnitTestRunner.java:518)
    [junit] 	at org.apache.tools.ant.taskdefs.optional.junit.JUnitTestRunner.launch(JUnitTestRunner.java:1052)
    [junit] 	at org.apache.tools.ant.taskdefs.optional.junit.JUnitTestRunner.main(JUnitTestRunner.java:906)
    [junit] 2013-11-21 10:18:41,488 [myid:] - INFO  [main:ClientBase@451] - tearDown starting
    [junit] 2013-11-21 10:18:46,167 [myid:] - INFO  [main:ZooKeeper@684] - Session: 0x1427a2680090004
closed
    [junit] 2013-11-21 10:18:46,167 [myid:] - INFO  [main-EventThread:ClientCnxn$EventThread@509]
- EventThread shut down
    [junit] 2013-11-21 10:18:46,167 [myid:] - INFO  [main:ClientBase@421] - STOPPING server
    [junit] 2013-11-21 10:18:46,168 [myid:] - INFO  [NIOServerCxn.Factory:0.0.0.0/0.0.0.0:11221:NIOServerCnxnFactory@224]
- NIOServerCnxn factory exited run method
    [junit] 2013-11-21 10:18:46,169 [myid:] - INFO  [main:ZooKeeperServer@441] - shutting
down
    [junit] 2013-11-21 10:18:46,184 [myid:] - INFO  [main:SessionTrackerImpl@225] - Shutting
down
    [junit] 2013-11-21 10:18:46,184 [myid:] - INFO  [main:PrepRequestProcessor@761] - Shutting
down
    [junit] 2013-11-21 10:18:46,184 [myid:] - INFO  [main:SyncRequestProcessor@209] - Shutting
down
    [junit] 2013-11-21 10:18:46,184 [myid:] - INFO  [ProcessThread(sid:0 cport:-1)::PrepRequestProcessor@143]
- PrepRequestProcessor exited loop!
    [junit] 2013-11-21 10:18:46,184 [myid:] - INFO  [SyncThread:0:SyncRequestProcessor@187]
- SyncRequestProcessor exited!
    [junit] 2013-11-21 10:18:46,185 [myid:] - INFO  [main:FinalRequestProcessor@415] - shutdown
of request processor complete
    [junit] 2013-11-21 10:18:46,285 [myid:] - INFO  [main:FourLetterWordMain@43] - connecting
to 127.0.0.1 11221
    [junit] 2013-11-21 10:18:48,000 [myid:] - INFO  [SessionTracker:SessionTrackerImpl@162]
- SessionTrackerImpl exited loop!
    [junit] 2013-11-21 10:18:51,250 [myid:] - INFO  [main:FourLetterWordMain@43] - connecting
to 127.0.0.1 11221
    [junit] 2013-11-21 10:18:54,676 [myid:] - INFO  [main:FourLetterWordMain@43] - connecting
to 127.0.0.1 11221
    [junit] 2013-11-21 10:18:59,411 [myid:] - INFO  [main:FourLetterWordMain@43] - connecting
to 127.0.0.1 11221
    [junit] 2013-11-21 10:19:04,240 [myid:] - INFO  [main:FourLetterWordMain@43] - connecting
to 127.0.0.1 11221
    [junit] 2013-11-21 10:19:08,468 [myid:] - INFO  [main:FourLetterWordMain@43] - connecting
to 127.0.0.1 11221
    [junit] 2013-11-21 10:19:11,183 [myid:] - INFO  [main:FourLetterWordMain@43] - connecting
to 127.0.0.1 11221
    [junit] 2013-11-21 10:19:12,895 [myid:] - INFO  [main:FourLetterWordMain@43] - connecting
to 127.0.0.1 11221
    [junit] 2013-11-21 10:19:15,011 [myid:] - INFO  [main:FourLetterWordMain@43] - connecting
to 127.0.0.1 11221
    [junit] 2013-11-21 10:19:16,521 [myid:] - INFO  [main:FourLetterWordMain@43] - connecting
to 127.0.0.1 11221
    [junit] 2013-11-21 10:19:21,408 [myid:] - INFO  [main:ZKTestCase$1@65] - FAILED testQuota
    [junit] org.junit.internal.runners.model.MultipleFailureException
    [junit] 	at org.junit.internal.runners.model.MultipleFailureException.assertEmpty(MultipleFailureException.java:23)
    [junit] 	at org.junit.internal.runners.statements.RunAfters.evaluate(RunAfters.java:42)
    [junit] 	at org.junit.rules.TestWatchman$1.evaluate(TestWatchman.java:48)
    [junit] 	at org.junit.runners.BlockJUnit4ClassRunner.runChild(BlockJUnit4ClassRunner.java:76)
    [junit] 	at org.junit.runners.BlockJUnit4ClassRunner.runChild(BlockJUnit4ClassRunner.java:50)
    [junit] 	at org.junit.runners.ParentRunner$3.run(ParentRunner.java:193)
    [junit] 	at org.junit.runners.ParentRunner$1.schedule(ParentRunner.java:52)
    [junit] 	at org.junit.runners.ParentRunner.runChildren(ParentRunner.java:191)
    [junit] 	at org.junit.runners.ParentRunner.access$000(ParentRunner.java:42)
    [junit] 	at org.junit.runners.ParentRunner$2.evaluate(ParentRunner.java:184)
    [junit] 	at org.junit.runners.ParentRunner.run(ParentRunner.java:236)
    [junit] 	at junit.framework.JUnit4TestAdapter.run(JUnit4TestAdapter.java:39)
    [junit] 	at org.apache.tools.ant.taskdefs.optional.junit.JUnitTestRunner.run(JUnitTestRunner.java:518)
    [junit] 	at org.apache.tools.ant.taskdefs.optional.junit.JUnitTestRunner.launch(JUnitTestRunner.java:1052)
    [junit] 	at org.apache.tools.ant.taskdefs.optional.junit.JUnitTestRunner.main(JUnitTestRunner.java:906)
    [junit] 2013-11-21 10:19:21,437 [myid:] - INFO  [main:ZKTestCase$1@55] - FINISHED testQuota
    [junit] Tests run: 1, Failures: 2, Errors: 0, Time elapsed: 45.566 sec
    [junit] Test org.apache.zookeeper.test.ZooKeeperQuotaTest FAILED

BUILD FAILED
f:\hudson\hudson-slave\workspace\ZooKeeper-3.4-WinVS2008_java\branch-3.4\build.xml:1251: Tests
failed!

Total time: 107 minutes 39 seconds
Build step 'Invoke Ant' marked build as failure
Recording test results
Email was triggered for: Failure
Sending email for trigger: Failure



###################################################################################
############################## FAILED TESTS (if any) ##############################
No tests ran.
Mime
  • Unnamed multipart/mixed (inline, None, 0 bytes)
View raw message