zookeeper-dev mailing list archives

Site index · List index
Message view « Date » · « Thread »
Top « Date » · « Thread »
From Apache Jenkins Server <jenk...@builds.apache.org>
Subject ZooKeeper_branch33_solaris - Build # 699 - Still Failing
Date Wed, 06 Nov 2013 07:04:36 GMT
See https://builds.apache.org/job/ZooKeeper_branch33_solaris/699/

###################################################################################
########################## LAST 60 LINES OF THE CONSOLE ###########################
[...truncated 96855 lines...]
    [junit] 2013-11-06 07:03:56,900 - INFO  [main:FileTxnSnapLog@256] - Snapshotting: b
    [junit] 2013-11-06 07:03:56,902 - INFO  [main:FourLetterWordMain@43] - connecting to 127.0.0.1
11221
    [junit] 2013-11-06 07:03:56,903 - INFO  [NIOServerCxn.Factory:0.0.0.0/0.0.0.0:11221:NIOServerCnxn$Factory@251]
- Accepted socket connection from /127.0.0.1:61145
    [junit] 2013-11-06 07:03:56,904 - INFO  [NIOServerCxn.Factory:0.0.0.0/0.0.0.0:11221:NIOServerCnxn@1237]
- Processing stat command from /127.0.0.1:61145
    [junit] 2013-11-06 07:03:56,905 - INFO  [Thread-4:NIOServerCnxn$StatCommand@1153] - Stat
command output
    [junit] 2013-11-06 07:03:56,906 - INFO  [Thread-4:NIOServerCnxn@1435] - Closed socket
connection for client /127.0.0.1:61145 (no session established for client)
    [junit] ensureOnly:[InMemoryDataTree, StandaloneServer_port]
    [junit] expect:InMemoryDataTree
    [junit] found:InMemoryDataTree org.apache.ZooKeeperService:name0=StandaloneServer_port-1,name1=InMemoryDataTree
    [junit] expect:StandaloneServer_port
    [junit] found:StandaloneServer_port org.apache.ZooKeeperService:name0=StandaloneServer_port-1
    [junit] 2013-11-06 07:03:56,908 - INFO  [main:ClientBase@408] - STOPPING server
    [junit] 2013-11-06 07:03:56,910 - INFO  [ProcessThread:-1:PrepRequestProcessor@128] -
PrepRequestProcessor exited loop!
    [junit] 2013-11-06 07:03:56,910 - INFO  [SyncThread:0:SyncRequestProcessor@151] - SyncRequestProcessor
exited!
    [junit] 2013-11-06 07:03:56,911 - INFO  [main:FinalRequestProcessor@370] - shutdown of
request processor complete
    [junit] 2013-11-06 07:03:56,912 - INFO  [main:FourLetterWordMain@43] - connecting to 127.0.0.1
11221
    [junit] ensureOnly:[]
    [junit] 2013-11-06 07:03:56,914 - INFO  [main:ClientBase@401] - STARTING server
    [junit] 2013-11-06 07:03:56,915 - INFO  [main:ZooKeeperServer@154] - Created server with
tickTime 3000 minSessionTimeout 6000 maxSessionTimeout 60000 datadir /zonestorage/hudson_solaris/home/hudson/hudson-slave/workspace/ZooKeeper_branch33_solaris/trunk/build/test/tmp/test5375305303677063742.junit.dir/version-2
snapdir /zonestorage/hudson_solaris/home/hudson/hudson-slave/workspace/ZooKeeper_branch33_solaris/trunk/build/test/tmp/test5375305303677063742.junit.dir/version-2
    [junit] 2013-11-06 07:03:56,916 - INFO  [main:NIOServerCnxn$Factory@143] - binding to
port 0.0.0.0/0.0.0.0:11221
    [junit] 2013-11-06 07:03:56,917 - INFO  [main:FileSnap@82] - Reading snapshot /zonestorage/hudson_solaris/home/hudson/hudson-slave/workspace/ZooKeeper_branch33_solaris/trunk/build/test/tmp/test5375305303677063742.junit.dir/version-2/snapshot.b
    [junit] 2013-11-06 07:03:56,920 - INFO  [main:FileTxnSnapLog@256] - Snapshotting: b
    [junit] 2013-11-06 07:03:56,922 - INFO  [main:FourLetterWordMain@43] - connecting to 127.0.0.1
11221
    [junit] 2013-11-06 07:03:56,923 - INFO  [NIOServerCxn.Factory:0.0.0.0/0.0.0.0:11221:NIOServerCnxn$Factory@251]
- Accepted socket connection from /127.0.0.1:61147
    [junit] 2013-11-06 07:03:56,924 - INFO  [NIOServerCxn.Factory:0.0.0.0/0.0.0.0:11221:NIOServerCnxn@1237]
- Processing stat command from /127.0.0.1:61147
    [junit] 2013-11-06 07:03:56,925 - INFO  [Thread-5:NIOServerCnxn$StatCommand@1153] - Stat
command output
    [junit] 2013-11-06 07:03:56,926 - INFO  [Thread-5:NIOServerCnxn@1435] - Closed socket
connection for client /127.0.0.1:61147 (no session established for client)
    [junit] ensureOnly:[InMemoryDataTree, StandaloneServer_port]
    [junit] expect:InMemoryDataTree
    [junit] found:InMemoryDataTree org.apache.ZooKeeperService:name0=StandaloneServer_port-1,name1=InMemoryDataTree
    [junit] expect:StandaloneServer_port
    [junit] found:StandaloneServer_port org.apache.ZooKeeperService:name0=StandaloneServer_port-1
    [junit] 2013-11-06 07:03:56,928 - INFO  [main:ClientBase@431] - tearDown starting
    [junit] 2013-11-06 07:03:56,928 - INFO  [main:ClientBase@443] - fdcount after test is:
41
    [junit] 2013-11-06 07:03:56,974 - INFO  [main:ZooKeeper@544] - Session: 0x1422c39752e0000
closed
    [junit] 2013-11-06 07:03:56,974 - INFO  [main-EventThread:ClientCnxn$EventThread@516]
- EventThread shut down
    [junit] 2013-11-06 07:03:56,975 - INFO  [main:ClientBase@408] - STOPPING server
    [junit] 2013-11-06 07:03:56,978 - INFO  [ProcessThread:-1:PrepRequestProcessor@128] -
PrepRequestProcessor exited loop!
    [junit] 2013-11-06 07:03:56,978 - INFO  [SyncThread:0:SyncRequestProcessor@151] - SyncRequestProcessor
exited!
    [junit] 2013-11-06 07:03:56,979 - INFO  [main:FinalRequestProcessor@370] - shutdown of
request processor complete
    [junit] 2013-11-06 07:03:56,980 - INFO  [main:FourLetterWordMain@43] - connecting to 127.0.0.1
11221
    [junit] ensureOnly:[]
    [junit] 2013-11-06 07:03:56,985 - INFO  [main:ClientBase@460] - FINISHED testQuota
    [junit] 2013-11-06 07:03:56,986 - INFO  [main:ZooKeeperQuotaTest@52] - STOPPING org.apache.zookeeper.test.ZooKeeperQuotaTest
    [junit] Tests run: 1, Failures: 0, Errors: 0, Time elapsed: 18.962 sec
    [junit] 2013-11-06 07:03:57,003 - INFO  [SessionTracker:SessionTrackerImpl@161] - SessionTrackerImpl
exited loop!
    [junit] 2013-11-06 07:03:57,003 - INFO  [SessionTracker:SessionTrackerImpl@161] - SessionTrackerImpl
exited loop!
    [junit] 2013-11-06 07:03:57,003 - INFO  [SessionTracker:SessionTrackerImpl@161] - SessionTrackerImpl
exited loop!

BUILD FAILED
/zonestorage/hudson_solaris/home/hudson/hudson-slave/workspace/ZooKeeper_branch33_solaris/trunk/build.xml:845:
Tests failed!

Total time: 29 minutes 14 seconds
Build step 'Invoke Ant' marked build as failure
[locks-and-latches] Releasing all the locks
[locks-and-latches] All the locks released
Recording test results
Email was triggered for: Failure
Sending email for trigger: Failure



###################################################################################
############################## FAILED TESTS (if any) ##############################
2 tests failed.
REGRESSION:  org.apache.zookeeper.test.QuorumZxidSyncTest.testLateLogs

Error Message:
waiting for server up

Stack Trace:
junit.framework.AssertionFailedError: waiting for server up
	at org.apache.zookeeper.test.QuorumBase.startServers(QuorumBase.java:186)
	at org.apache.zookeeper.test.QuorumBase.startServers(QuorumBase.java:111)
	at org.apache.zookeeper.test.QuorumZxidSyncTest.testLateLogs(QuorumZxidSyncTest.java:124)


FAILED:  org.apache.zookeeper.test.SessionTest.testSessionMove

Error Message:
Should have lost the connection

Stack Trace:
junit.framework.AssertionFailedError: Should have lost the connection
	at org.apache.zookeeper.test.SessionTest.testSessionMove(SessionTest.java:308)



Mime
  • Unnamed multipart/mixed (inline, None, 0 bytes)
View raw message