zookeeper-dev mailing list archives

Site index · List index
Message view « Date » · « Thread »
Top « Date » · « Thread »
From Apache Jenkins Server <jenk...@builds.apache.org>
Subject Failed: ZOOKEEPER-1804 PreCommit Build #1738
Date Mon, 04 Nov 2013 06:55:44 GMT
Jira: https://issues.apache.org/jira/browse/ZOOKEEPER-1804
Build: https://builds.apache.org/job/PreCommit-ZOOKEEPER-Build/1738/

###################################################################################
########################## LAST 60 LINES OF THE CONSOLE ###########################
[...truncated 84 lines...]
     [exec] Hunk #4 FAILED at 128.
     [exec] 4 out of 4 hunks FAILED -- saving rejects to file b/src/main/java/org/apache/zookeeper/server/ServerStats.java.rej
     [exec] patching file b/src/main/java/org/apache/zookeeper/server/ZooKeeperServer.java
     [exec] Hunk #1 FAILED at 29.
     [exec] Hunk #2 FAILED at 567.
     [exec] patch unexpectedly ends in middle of line
     [exec] Hunk #3 FAILED at 733.
     [exec] 3 out of 3 hunks FAILED -- saving rejects to file b/src/main/java/org/apache/zookeeper/server/ZooKeeperServer.java.rej
     [exec] PATCH APPLICATION FAILED
     [exec] 
     [exec] 
     [exec] 
     [exec] 
     [exec] -1 overall.  Here are the results of testing the latest attachment 
     [exec]   http://issues.apache.org/jira/secure/attachment/12611868/ZOOKEEPER-1804-2.patch
     [exec]   against trunk revision 1535491.
     [exec] 
     [exec]     +1 @author.  The patch does not contain any @author tags.
     [exec] 
     [exec]     -1 tests included.  The patch doesn't appear to include any new or modified
tests.
     [exec]                         Please justify why no new tests are needed for this patch.
     [exec]                         Also please list what manual steps were performed to verify
this patch.
     [exec] 
     [exec]     -1 patch.  The patch command could not apply the patch.
     [exec] 
     [exec] Console output: https://builds.apache.org/job/PreCommit-ZOOKEEPER-Build/1738//console
     [exec] 
     [exec] This message is automatically generated.
     [exec] 
     [exec] 
     [exec] ======================================================================
     [exec] ======================================================================
     [exec]     Adding comment to Jira.
     [exec] ======================================================================
     [exec] ======================================================================
     [exec] 
     [exec] 
     [exec] Comment added.
     [exec] 8add5ea552e0433b27af9f78d39d12321b2a22c4 logged out
     [exec] 
     [exec] 
     [exec] ======================================================================
     [exec] ======================================================================
     [exec]     Finished build.
     [exec] ======================================================================
     [exec] ======================================================================
     [exec] 
     [exec] 

BUILD FAILED
/home/jenkins/jenkins-slave/workspace/PreCommit-ZOOKEEPER-Build/trunk/build.xml:1623: exec
returned: 1

Total time: 1 minute 1 second
Build step 'Execute shell' marked build as failure
Archiving artifacts
Recording test results
Description set: ZOOKEEPER-1804
Email was triggered for: Failure
Sending email for trigger: Failure



###################################################################################
############################## FAILED TESTS (if any) ##############################
No tests ran.
Mime
  • Unnamed multipart/mixed (inline, None, 0 bytes)
View raw message