zookeeper-dev mailing list archives

Site index · List index
Message view « Date » · « Thread »
Top « Date » · « Thread »
From Apache Jenkins Server <jenk...@builds.apache.org>
Subject ZooKeeper-trunk - Build # 2131 - Still Failing
Date Mon, 25 Nov 2013 10:33:23 GMT
See https://builds.apache.org/job/ZooKeeper-trunk/2131/

###################################################################################
########################## LAST 60 LINES OF THE CONSOLE ###########################
[...truncated 2574 lines...]
     [copy] Copying 1 file to /home/jenkins/jenkins-slave/workspace/ZooKeeper-trunk/trunk/build/zookeeper-3.5.0/recipes/queue/test
    [mkdir] Created dir: /home/jenkins/jenkins-slave/workspace/ZooKeeper-trunk/trunk/build/zookeeper-3.5.0/recipes/queue/src
     [copy] Copying 16 files to /home/jenkins/jenkins-slave/workspace/ZooKeeper-trunk/trunk/build/zookeeper-3.5.0/recipes/queue/src
     [copy] Copying 1 file to /home/jenkins/jenkins-slave/workspace/ZooKeeper-trunk/trunk/build/zookeeper-3.5.0
    [mkdir] Created dir: /home/jenkins/jenkins-slave/workspace/ZooKeeper-trunk/trunk/build/zookeeper-3.5.0/dist-maven
     [copy] Copying 1 file to /home/jenkins/jenkins-slave/workspace/ZooKeeper-trunk/trunk/build/zookeeper-3.5.0/dist-maven
     [copy] Copying 2 files to /home/jenkins/jenkins-slave/workspace/ZooKeeper-trunk/trunk/build/zookeeper-3.5.0/dist-maven
     [copy] Copying 1 file to /home/jenkins/jenkins-slave/workspace/ZooKeeper-trunk/trunk/build/zookeeper-3.5.0/dist-maven
     [copy] Copying 9 files to /home/jenkins/jenkins-slave/workspace/ZooKeeper-trunk/trunk/build/zookeeper-3.5.0/bin
     [copy] Copying 3 files to /home/jenkins/jenkins-slave/workspace/ZooKeeper-trunk/trunk/build/zookeeper-3.5.0/conf
     [copy] Copying 323 files to /home/jenkins/jenkins-slave/workspace/ZooKeeper-trunk/trunk/build/zookeeper-3.5.0/docs
     [copy] Copied 20 empty directories to 3 empty directories under /home/jenkins/jenkins-slave/workspace/ZooKeeper-trunk/trunk/build/zookeeper-3.5.0/docs
     [copy] Copying 8 files to /home/jenkins/jenkins-slave/workspace/ZooKeeper-trunk/trunk/build/zookeeper-3.5.0
     [copy] Copying 978 files to /home/jenkins/jenkins-slave/workspace/ZooKeeper-trunk/trunk/build/zookeeper-3.5.0/src
     [copy] Copied 265 empty directories to 2 empty directories under /home/jenkins/jenkins-slave/workspace/ZooKeeper-trunk/trunk/build/zookeeper-3.5.0/src

tar:
      [tar] Building tar: /home/jenkins/jenkins-slave/workspace/ZooKeeper-trunk/trunk/build/zookeeper-3.5.0.tar.gz

check-for-findbugs:

findbugs:
    [mkdir] Created dir: /home/jenkins/jenkins-slave/workspace/ZooKeeper-trunk/trunk/build/test/findbugs
 [findbugs] Executing findbugs from ant task
 [findbugs] Running FindBugs...
FATAL: hudson.remoting.RequestAbortedException: java.io.IOException: Unexpected termination
of the channel
hudson.remoting.RequestAbortedException: hudson.remoting.RequestAbortedException: java.io.IOException:
Unexpected termination of the channel
	at hudson.remoting.RequestAbortedException.wrapForRethrow(RequestAbortedException.java:41)
	at hudson.remoting.RequestAbortedException.wrapForRethrow(RequestAbortedException.java:34)
	at hudson.remoting.Request.call(Request.java:174)
	at hudson.remoting.Channel.call(Channel.java:722)
	at hudson.remoting.RemoteInvocationHandler.invoke(RemoteInvocationHandler.java:167)
	at com.sun.proxy.$Proxy47.join(Unknown Source)
	at hudson.Launcher$RemoteLauncher$ProcImpl.join(Launcher.java:925)
	at hudson.Launcher$ProcStarter.join(Launcher.java:360)
	at hudson.tasks.CommandInterpreter.perform(CommandInterpreter.java:94)
	at hudson.tasks.CommandInterpreter.perform(CommandInterpreter.java:63)
	at hudson.tasks.BuildStepMonitor$1.perform(BuildStepMonitor.java:20)
	at hudson.model.AbstractBuild$AbstractBuildExecution.perform(AbstractBuild.java:785)
	at hudson.model.Build$BuildExecution.build(Build.java:199)
	at hudson.model.Build$BuildExecution.doRun(Build.java:160)
	at hudson.model.AbstractBuild$AbstractBuildExecution.run(AbstractBuild.java:566)
	at hudson.model.Run.execute(Run.java:1679)
	at hudson.model.FreeStyleBuild.run(FreeStyleBuild.java:46)
	at hudson.model.ResourceController.execute(ResourceController.java:88)
	at hudson.model.Executor.run(Executor.java:230)
Caused by: hudson.remoting.RequestAbortedException: java.io.IOException: Unexpected termination
of the channel
	at hudson.remoting.Request.abort(Request.java:299)
	at hudson.remoting.Channel.terminate(Channel.java:782)
	at hudson.remoting.SynchronousCommandTransport$ReaderThread.run(SynchronousCommandTransport.java:69)
Caused by: java.io.IOException: Unexpected termination of the channel
	at hudson.remoting.SynchronousCommandTransport$ReaderThread.run(SynchronousCommandTransport.java:50)
Caused by: java.io.EOFException
	at java.io.ObjectInputStream$BlockDataInputStream.peekByte(ObjectInputStream.java:2596)
	at java.io.ObjectInputStream.readObject0(ObjectInputStream.java:1316)
	at java.io.ObjectInputStream.readObject(ObjectInputStream.java:370)
	at hudson.remoting.Command.readFrom(Command.java:92)
	at hudson.remoting.ClassicCommandTransport.read(ClassicCommandTransport.java:71)
	at hudson.remoting.SynchronousCommandTransport$ReaderThread.run(SynchronousCommandTransport.java:48)



###################################################################################
############################## FAILED TESTS (if any) ##############################
No tests ran.
Mime
  • Unnamed multipart/mixed (inline, None, 0 bytes)
View raw message