zookeeper-dev mailing list archives

Site index · List index
Message view « Date » · « Thread »
Top « Date » · « Thread »
From Apache Jenkins Server <jenk...@builds.apache.org>
Subject ZooKeeper-3.4-WinVS2008_java - Build # 352 - Still Failing
Date Wed, 20 Nov 2013 10:08:34 GMT
See https://builds.apache.org/job/ZooKeeper-3.4-WinVS2008_java/352/

###################################################################################
########################## LAST 60 LINES OF THE CONSOLE ###########################
[...truncated 211271 lines...]
    [junit] 	at org.junit.runners.ParentRunner.access$000(ParentRunner.java:42)
    [junit] 	at org.junit.runners.ParentRunner$2.evaluate(ParentRunner.java:184)
    [junit] 	at org.junit.runners.ParentRunner.run(ParentRunner.java:236)
    [junit] 	at junit.framework.JUnit4TestAdapter.run(JUnit4TestAdapter.java:39)
    [junit] 	at org.apache.tools.ant.taskdefs.optional.junit.JUnitTestRunner.run(JUnitTestRunner.java:518)
    [junit] 	at org.apache.tools.ant.taskdefs.optional.junit.JUnitTestRunner.launch(JUnitTestRunner.java:1052)
    [junit] 	at org.apache.tools.ant.taskdefs.optional.junit.JUnitTestRunner.main(JUnitTestRunner.java:906)
    [junit] 2013-11-20 10:07:53,480 [myid:] - INFO  [main:ClientBase@451] - tearDown starting
    [junit] 2013-11-20 10:07:58,198 [myid:] - INFO  [main:ZooKeeper@684] - Session: 0x14274f63c2c0005
closed
    [junit] 2013-11-20 10:07:58,198 [myid:] - INFO  [main:ClientBase@421] - STOPPING server
    [junit] 2013-11-20 10:07:58,198 [myid:] - INFO  [main-EventThread:ClientCnxn$EventThread@509]
- EventThread shut down
    [junit] 2013-11-20 10:07:58,200 [myid:] - INFO  [NIOServerCxn.Factory:0.0.0.0/0.0.0.0:11221:NIOServerCnxnFactory@224]
- NIOServerCnxn factory exited run method
    [junit] 2013-11-20 10:07:58,200 [myid:] - INFO  [main:ZooKeeperServer@441] - shutting
down
    [junit] 2013-11-20 10:07:58,209 [myid:] - INFO  [main:SessionTrackerImpl@225] - Shutting
down
    [junit] 2013-11-20 10:07:58,209 [myid:] - INFO  [main:PrepRequestProcessor@761] - Shutting
down
    [junit] 2013-11-20 10:07:58,209 [myid:] - INFO  [main:SyncRequestProcessor@209] - Shutting
down
    [junit] 2013-11-20 10:07:58,209 [myid:] - INFO  [ProcessThread(sid:0 cport:-1)::PrepRequestProcessor@143]
- PrepRequestProcessor exited loop!
    [junit] 2013-11-20 10:07:58,209 [myid:] - INFO  [SyncThread:0:SyncRequestProcessor@187]
- SyncRequestProcessor exited!
    [junit] 2013-11-20 10:07:58,209 [myid:] - INFO  [main:FinalRequestProcessor@415] - shutdown
of request processor complete
    [junit] 2013-11-20 10:07:58,310 [myid:] - INFO  [main:FourLetterWordMain@43] - connecting
to 127.0.0.1 11221
    [junit] 2013-11-20 10:08:00,000 [myid:] - INFO  [SessionTracker:SessionTrackerImpl@162]
- SessionTrackerImpl exited loop!
    [junit] 2013-11-20 10:08:02,047 [myid:] - INFO  [main:FourLetterWordMain@43] - connecting
to 127.0.0.1 11221
    [junit] 2013-11-20 10:08:05,267 [myid:] - INFO  [main:FourLetterWordMain@43] - connecting
to 127.0.0.1 11221
    [junit] 2013-11-20 10:08:10,096 [myid:] - INFO  [main:FourLetterWordMain@43] - connecting
to 127.0.0.1 11221
    [junit] 2013-11-20 10:08:11,001 [myid:] - INFO  [main:FourLetterWordMain@43] - connecting
to 127.0.0.1 11221
    [junit] 2013-11-20 10:08:13,517 [myid:] - INFO  [main:FourLetterWordMain@43] - connecting
to 127.0.0.1 11221
    [junit] 2013-11-20 10:08:16,840 [myid:] - INFO  [main:FourLetterWordMain@43] - connecting
to 127.0.0.1 11221
    [junit] 2013-11-20 10:08:20,364 [myid:] - INFO  [main:FourLetterWordMain@43] - connecting
to 127.0.0.1 11221
    [junit] 2013-11-20 10:08:25,095 [myid:] - INFO  [main:FourLetterWordMain@43] - connecting
to 127.0.0.1 11221
    [junit] 2013-11-20 10:08:28,312 [myid:] - INFO  [main:FourLetterWordMain@43] - connecting
to 127.0.0.1 11221
    [junit] 2013-11-20 10:08:30,780 [myid:] - INFO  [main:ZKTestCase$1@65] - FAILED testQuota
    [junit] org.junit.internal.runners.model.MultipleFailureException
    [junit] 	at org.junit.internal.runners.model.MultipleFailureException.assertEmpty(MultipleFailureException.java:23)
    [junit] 	at org.junit.internal.runners.statements.RunAfters.evaluate(RunAfters.java:42)
    [junit] 	at org.junit.rules.TestWatchman$1.evaluate(TestWatchman.java:48)
    [junit] 	at org.junit.runners.BlockJUnit4ClassRunner.runChild(BlockJUnit4ClassRunner.java:76)
    [junit] 	at org.junit.runners.BlockJUnit4ClassRunner.runChild(BlockJUnit4ClassRunner.java:50)
    [junit] 	at org.junit.runners.ParentRunner$3.run(ParentRunner.java:193)
    [junit] 	at org.junit.runners.ParentRunner$1.schedule(ParentRunner.java:52)
    [junit] 	at org.junit.runners.ParentRunner.runChildren(ParentRunner.java:191)
    [junit] 	at org.junit.runners.ParentRunner.access$000(ParentRunner.java:42)
    [junit] 	at org.junit.runners.ParentRunner$2.evaluate(ParentRunner.java:184)
    [junit] 	at org.junit.runners.ParentRunner.run(ParentRunner.java:236)
    [junit] 	at junit.framework.JUnit4TestAdapter.run(JUnit4TestAdapter.java:39)
    [junit] 	at org.apache.tools.ant.taskdefs.optional.junit.JUnitTestRunner.run(JUnitTestRunner.java:518)
    [junit] 	at org.apache.tools.ant.taskdefs.optional.junit.JUnitTestRunner.launch(JUnitTestRunner.java:1052)
    [junit] 	at org.apache.tools.ant.taskdefs.optional.junit.JUnitTestRunner.main(JUnitTestRunner.java:906)
    [junit] 2013-11-20 10:08:30,798 [myid:] - INFO  [main:ZKTestCase$1@55] - FINISHED testQuota
    [junit] Tests run: 1, Failures: 2, Errors: 0, Time elapsed: 44.174 sec
    [junit] Test org.apache.zookeeper.test.ZooKeeperQuotaTest FAILED

BUILD FAILED
f:\hudson\hudson-slave\workspace\ZooKeeper-3.4-WinVS2008_java\branch-3.4\build.xml:1251: Tests
failed!

Total time: 96 minutes 34 seconds
Build step 'Invoke Ant' marked build as failure
Recording test results
Email was triggered for: Failure
Sending email for trigger: Failure



###################################################################################
############################## FAILED TESTS (if any) ##############################
No tests ran.
Mime
  • Unnamed multipart/mixed (inline, None, 0 bytes)
View raw message