zookeeper-dev mailing list archives

Site index · List index
Message view « Date » · « Thread »
Top « Date » · « Thread »
From Apache Jenkins Server <jenk...@builds.apache.org>
Subject Failed: ZOOKEEPER-1808 PreCommit Build #1744
Date Tue, 05 Nov 2013 18:12:25 GMT
Jira: https://issues.apache.org/jira/browse/ZOOKEEPER-1808
Build: https://builds.apache.org/job/PreCommit-ZOOKEEPER-Build/1744/

###################################################################################
########################## LAST 60 LINES OF THE CONSOLE ###########################
[...truncated 111 lines...]
     [exec] 7 out of 7 hunks FAILED -- saving rejects to file java/main/org/apache/zookeeper/server/quorum/FastLeaderElection.java.rej
     [exec] patching file java/main/org/apache/zookeeper/server/quorum/Vote.java
     [exec] Hunk #1 FAILED at 23.
     [exec] Hunk #2 FAILED at 31.
     [exec] Hunk #3 FAILED at 39.
     [exec] Hunk #4 FAILED at 47.
     [exec] Hunk #5 FAILED at 55.
     [exec] Hunk #6 FAILED at 63.
     [exec] Hunk #7 FAILED at 91.
     [exec] 7 out of 7 hunks FAILED -- saving rejects to file java/main/org/apache/zookeeper/server/quorum/Vote.java.rej
     [exec] PATCH APPLICATION FAILED
     [exec] 
     [exec] 
     [exec] 
     [exec] 
     [exec] -1 overall.  Here are the results of testing the latest attachment 
     [exec]   http://issues.apache.org/jira/secure/attachment/12612210/ZOOKEEPER-1808.patch
     [exec]   against trunk revision 1538853.
     [exec] 
     [exec]     +1 @author.  The patch does not contain any @author tags.
     [exec] 
     [exec]     +1 tests included.  The patch appears to include 21 new or modified tests.
     [exec] 
     [exec]     -1 patch.  The patch command could not apply the patch.
     [exec] 
     [exec] Console output: https://builds.apache.org/job/PreCommit-ZOOKEEPER-Build/1744//console
     [exec] 
     [exec] This message is automatically generated.
     [exec] 
     [exec] 
     [exec] ======================================================================
     [exec] ======================================================================
     [exec]     Adding comment to Jira.
     [exec] ======================================================================
     [exec] ======================================================================
     [exec] 
     [exec] 
     [exec] Comment added.
     [exec] 29f92141cd87bd82473320f5d819c945153f3cf2 logged out
     [exec] 
     [exec] 
     [exec] ======================================================================
     [exec] ======================================================================
     [exec]     Finished build.
     [exec] ======================================================================
     [exec] ======================================================================
     [exec] 
     [exec] 

BUILD FAILED
/home/jenkins/jenkins-slave/workspace/PreCommit-ZOOKEEPER-Build/trunk/build.xml:1623: exec
returned: 1

Total time: 1 minute 0 seconds
Build step 'Execute shell' marked build as failure
Archiving artifacts
Recording test results
Description set: ZOOKEEPER-1808
Email was triggered for: Failure
Sending email for trigger: Failure



###################################################################################
############################## FAILED TESTS (if any) ##############################
No tests ran.
Mime
  • Unnamed multipart/mixed (inline, None, 0 bytes)
View raw message