zookeeper-dev mailing list archives

Site index · List index
Message view « Date » · « Thread »
Top « Date » · « Thread »
From Apache Jenkins Server <jenk...@builds.apache.org>
Subject ZooKeeper-trunk-jdk7 - Build # 704 - Still Failing
Date Sun, 10 Nov 2013 07:09:03 GMT
See https://builds.apache.org/job/ZooKeeper-trunk-jdk7/704/

###################################################################################
########################## LAST 60 LINES OF THE CONSOLE ###########################
[...truncated 226341 lines...]
    [junit] 2013-11-10 07:07:39,789 [myid:] - INFO  [main:SessionTrackerImpl@183] - Shutting
down
    [junit] 2013-11-10 07:07:39,789 [myid:] - INFO  [main:PrepRequestProcessor@972] - Shutting
down
    [junit] 2013-11-10 07:07:39,789 [myid:] - INFO  [main:SyncRequestProcessor@190] - Shutting
down
    [junit] 2013-11-10 07:07:39,789 [myid:] - INFO  [ProcessThread(sid:0 cport:-1)::PrepRequestProcessor@156]
- PrepRequestProcessor exited loop!
    [junit] 2013-11-10 07:07:39,789 [myid:] - INFO  [SyncThread:0:SyncRequestProcessor@168]
- SyncRequestProcessor exited!
    [junit] 2013-11-10 07:07:39,790 [myid:] - INFO  [main:FinalRequestProcessor@442] - shutdown
of request processor complete
    [junit] 2013-11-10 07:07:39,790 [myid:] - INFO  [main:FourLetterWordMain@43] - connecting
to 127.0.0.1 11221
    [junit] 2013-11-10 07:07:39,790 [myid:] - INFO  [main:JMXEnv@133] - ensureOnly:[]
    [junit] 2013-11-10 07:07:39,792 [myid:] - INFO  [main:ClientBase@414] - STARTING server
    [junit] 2013-11-10 07:07:39,792 [myid:] - INFO  [main:ZooKeeperServer@149] - Created server
with tickTime 3000 minSessionTimeout 6000 maxSessionTimeout 60000 datadir /home/hudson/jenkins-slave/workspace/ZooKeeper-trunk-jdk7/trunk/build/test/tmp/test1113020536164229930.junit.dir/version-2
snapdir /home/hudson/jenkins-slave/workspace/ZooKeeper-trunk-jdk7/trunk/build/test/tmp/test1113020536164229930.junit.dir/version-2
    [junit] 2013-11-10 07:07:39,792 [myid:] - INFO  [main:NIOServerCnxnFactory@670] - Configuring
NIO connection handler with 10s sessionless connection timeout, 2 selector thread(s), 16 worker
threads, and 64 kB direct buffers.
    [junit] 2013-11-10 07:07:39,793 [myid:] - INFO  [main:NIOServerCnxnFactory@683] - binding
to port 0.0.0.0/0.0.0.0:11221
    [junit] 2013-11-10 07:07:39,793 [myid:] - INFO  [main:FileSnap@83] - Reading snapshot
/home/hudson/jenkins-slave/workspace/ZooKeeper-trunk-jdk7/trunk/build/test/tmp/test1113020536164229930.junit.dir/version-2/snapshot.b
    [junit] 2013-11-10 07:07:39,795 [myid:] - INFO  [main:FileTxnSnapLog@297] - Snapshotting:
0xb to /home/hudson/jenkins-slave/workspace/ZooKeeper-trunk-jdk7/trunk/build/test/tmp/test1113020536164229930.junit.dir/version-2/snapshot.b
    [junit] 2013-11-10 07:07:39,797 [myid:] - INFO  [main:FourLetterWordMain@43] - connecting
to 127.0.0.1 11221
    [junit] 2013-11-10 07:07:39,797 [myid:] - INFO  [NIOServerCxnFactory.AcceptThread:0.0.0.0/0.0.0.0:11221:NIOServerCnxnFactory$AcceptThread@296]
- Accepted socket connection from /127.0.0.1:55169
    [junit] 2013-11-10 07:07:39,798 [myid:] - INFO  [NIOWorkerThread-1:NIOServerCnxn@828]
- Processing stat command from /127.0.0.1:55169
    [junit] 2013-11-10 07:07:39,798 [myid:] - INFO  [NIOWorkerThread-1:NIOServerCnxn$StatCommand@677]
- Stat command output
    [junit] 2013-11-10 07:07:39,798 [myid:] - INFO  [NIOWorkerThread-1:NIOServerCnxn@999]
- Closed socket connection for client /127.0.0.1:55169 (no session established for client)
    [junit] 2013-11-10 07:07:39,798 [myid:] - INFO  [main:JMXEnv@133] - ensureOnly:[InMemoryDataTree,
StandaloneServer_port]
    [junit] 2013-11-10 07:07:39,800 [myid:] - INFO  [main:JMXEnv@105] - expect:InMemoryDataTree
    [junit] 2013-11-10 07:07:39,800 [myid:] - INFO  [main:JMXEnv@108] - found:InMemoryDataTree
org.apache.ZooKeeperService:name0=StandaloneServer_port-1,name1=InMemoryDataTree
    [junit] 2013-11-10 07:07:39,800 [myid:] - INFO  [main:JMXEnv@105] - expect:StandaloneServer_port
    [junit] 2013-11-10 07:07:39,800 [myid:] - INFO  [main:JMXEnv@108] - found:StandaloneServer_port
org.apache.ZooKeeperService:name0=StandaloneServer_port-1
    [junit] 2013-11-10 07:07:39,800 [myid:] - INFO  [main:JUnit4ZKTestRunner$LoggedInvokeMethod@57]
- FINISHED TEST METHOD testQuota
    [junit] 2013-11-10 07:07:39,800 [myid:] - INFO  [main:ClientBase@451] - tearDown starting
    [junit] 2013-11-10 07:07:39,875 [myid:] - INFO  [main:ZooKeeper@777] - Session: 0x14240d65c210000
closed
    [junit] 2013-11-10 07:07:39,875 [myid:] - INFO  [main-EventThread:ClientCnxn$EventThread@513]
- EventThread shut down
    [junit] 2013-11-10 07:07:39,876 [myid:] - INFO  [main:ClientBase@421] - STOPPING server
    [junit] 2013-11-10 07:07:39,876 [myid:] - INFO  [ConnnectionExpirer:NIOServerCnxnFactory$ConnectionExpirerThread@583]
- ConnnectionExpirerThread interrupted
    [junit] 2013-11-10 07:07:39,876 [myid:] - INFO  [NIOServerCxnFactory.AcceptThread:0.0.0.0/0.0.0.0:11221:NIOServerCnxnFactory$AcceptThread@219]
- accept thread exitted run method
    [junit] 2013-11-10 07:07:39,876 [myid:] - INFO  [NIOServerCxnFactory.SelectorThread-1:NIOServerCnxnFactory$SelectorThread@420]
- selector thread exitted run method
    [junit] 2013-11-10 07:07:39,876 [myid:] - INFO  [NIOServerCxnFactory.SelectorThread-0:NIOServerCnxnFactory$SelectorThread@420]
- selector thread exitted run method
    [junit] 2013-11-10 07:07:39,877 [myid:] - INFO  [main:ZooKeeperServer@428] - shutting
down
    [junit] 2013-11-10 07:07:39,877 [myid:] - INFO  [main:SessionTrackerImpl@183] - Shutting
down
    [junit] 2013-11-10 07:07:39,877 [myid:] - INFO  [main:PrepRequestProcessor@972] - Shutting
down
    [junit] 2013-11-10 07:07:39,877 [myid:] - INFO  [main:SyncRequestProcessor@190] - Shutting
down
    [junit] 2013-11-10 07:07:39,877 [myid:] - INFO  [ProcessThread(sid:0 cport:-1)::PrepRequestProcessor@156]
- PrepRequestProcessor exited loop!
    [junit] 2013-11-10 07:07:39,877 [myid:] - INFO  [SyncThread:0:SyncRequestProcessor@168]
- SyncRequestProcessor exited!
    [junit] 2013-11-10 07:07:39,878 [myid:] - INFO  [main:FinalRequestProcessor@442] - shutdown
of request processor complete
    [junit] 2013-11-10 07:07:39,878 [myid:] - INFO  [main:FourLetterWordMain@43] - connecting
to 127.0.0.1 11221
    [junit] 2013-11-10 07:07:39,878 [myid:] - INFO  [main:JMXEnv@133] - ensureOnly:[]
    [junit] 2013-11-10 07:07:39,881 [myid:] - INFO  [main:ClientBase@476] - fdcount after
test is: 42 at start it was 30
    [junit] 2013-11-10 07:07:39,881 [myid:] - INFO  [main:ClientBase@478] - sleeping for 20
secs
    [junit] 2013-11-10 07:07:39,882 [myid:] - INFO  [main:ZKTestCase$1@61] - SUCCEEDED testQuota
    [junit] 2013-11-10 07:07:39,883 [myid:] - INFO  [main:ZKTestCase$1@56] - FINISHED testQuota
    [junit] Tests run: 1, Failures: 0, Errors: 0, Time elapsed: 0.723 sec

BUILD FAILED
/home/hudson/jenkins-slave/workspace/ZooKeeper-trunk-jdk7/trunk/build.xml:1264: Tests failed!

Total time: 33 minutes 37 seconds
Build step 'Execute shell' marked build as failure
[locks-and-latches] Releasing all the locks
[locks-and-latches] All the locks released
[WARNINGS] Skipping publisher since build result is FAILURE
Recording test results
Email was triggered for: Failure
Sending email for trigger: Failure



###################################################################################
############################## FAILED TESTS (if any) ##############################
2 tests failed.
REGRESSION:  org.apache.zookeeper.server.quorum.ReconfigRecoveryTest.testCurrentServersAreObserversInNextConfig

Error Message:
Forked Java VM exited abnormally. Please note the time in the report does not reflect the
time until the VM exit.

Stack Trace:
junit.framework.AssertionFailedError: Forked Java VM exited abnormally. Please note the time
in the report does not reflect the time until the VM exit.


REGRESSION:  org.apache.zookeeper.test.FLETest.testTripleElection

Error Message:
Fewer than a a majority has joined

Stack Trace:
junit.framework.AssertionFailedError: Fewer than a a majority has joined
	at org.apache.zookeeper.test.FLETest.runElection(FLETest.java:355)
	at org.apache.zookeeper.test.FLETest.testTripleElection(FLETest.java:282)
	at org.apache.zookeeper.JUnit4ZKTestRunner$LoggedInvokeMethod.evaluate(JUnit4ZKTestRunner.java:52)



Mime
  • Unnamed multipart/mixed (inline, None, 0 bytes)
View raw message