zookeeper-dev mailing list archives

Site index · List index
Message view « Date » · « Thread »
Top « Date » · « Thread »
From Apache Jenkins Server <jenk...@builds.apache.org>
Subject ZooKeeper_branch34 - Build # 799 - Failure
Date Wed, 20 Nov 2013 08:51:05 GMT
See https://builds.apache.org/job/ZooKeeper_branch34/799/

###################################################################################
########################## LAST 60 LINES OF THE CONSOLE ###########################
[...truncated 266470 lines...]
    [junit] 2013-11-20 08:50:57,709 [myid:] - INFO  [main:JMXEnv@133] - ensureOnly:[InMemoryDataTree,
StandaloneServer_port]
    [junit] 2013-11-20 08:50:57,710 [myid:] - INFO  [main:JMXEnv@105] - expect:InMemoryDataTree
    [junit] 2013-11-20 08:50:57,710 [myid:] - INFO  [main:JMXEnv@108] - found:InMemoryDataTree
org.apache.ZooKeeperService:name0=StandaloneServer_port-1,name1=InMemoryDataTree
    [junit] 2013-11-20 08:50:57,710 [myid:] - INFO  [main:JMXEnv@105] - expect:StandaloneServer_port
    [junit] 2013-11-20 08:50:57,710 [myid:] - INFO  [main:JMXEnv@108] - found:StandaloneServer_port
org.apache.ZooKeeperService:name0=StandaloneServer_port-1
    [junit] 2013-11-20 08:50:57,711 [myid:] - INFO  [main:ClientBase@421] - STOPPING server
    [junit] 2013-11-20 08:50:57,711 [myid:] - INFO  [NIOServerCxn.Factory:0.0.0.0/0.0.0.0:11221:NIOServerCnxnFactory@224]
- NIOServerCnxn factory exited run method
    [junit] 2013-11-20 08:50:57,711 [myid:] - INFO  [main:ZooKeeperServer@441] - shutting
down
    [junit] 2013-11-20 08:50:57,711 [myid:] - INFO  [main:SessionTrackerImpl@225] - Shutting
down
    [junit] 2013-11-20 08:50:57,711 [myid:] - INFO  [main:PrepRequestProcessor@761] - Shutting
down
    [junit] 2013-11-20 08:50:57,712 [myid:] - INFO  [main:SyncRequestProcessor@209] - Shutting
down
    [junit] 2013-11-20 08:50:57,712 [myid:] - INFO  [ProcessThread(sid:0 cport:-1)::PrepRequestProcessor@143]
- PrepRequestProcessor exited loop!
    [junit] 2013-11-20 08:50:57,712 [myid:] - INFO  [SyncThread:0:SyncRequestProcessor@187]
- SyncRequestProcessor exited!
    [junit] 2013-11-20 08:50:57,712 [myid:] - INFO  [main:FinalRequestProcessor@415] - shutdown
of request processor complete
    [junit] 2013-11-20 08:50:57,713 [myid:] - INFO  [main:FourLetterWordMain@43] - connecting
to 127.0.0.1 11221
    [junit] 2013-11-20 08:50:57,713 [myid:] - INFO  [main:JMXEnv@133] - ensureOnly:[]
    [junit] 2013-11-20 08:50:57,714 [myid:] - INFO  [main:ClientBase@414] - STARTING server
    [junit] 2013-11-20 08:50:57,715 [myid:] - INFO  [main:ZooKeeperServer@162] - Created server
with tickTime 3000 minSessionTimeout 6000 maxSessionTimeout 60000 datadir /home/jenkins/jenkins-slave/workspace/ZooKeeper_branch34/branch-3.4/build/test/tmp/test3929074981243496078.junit.dir/version-2
snapdir /home/jenkins/jenkins-slave/workspace/ZooKeeper_branch34/branch-3.4/build/test/tmp/test3929074981243496078.junit.dir/version-2
    [junit] 2013-11-20 08:50:57,715 [myid:] - INFO  [main:NIOServerCnxnFactory@94] - binding
to port 0.0.0.0/0.0.0.0:11221
    [junit] 2013-11-20 08:50:57,719 [myid:] - INFO  [main:FourLetterWordMain@43] - connecting
to 127.0.0.1 11221
    [junit] 2013-11-20 08:50:57,719 [myid:] - INFO  [NIOServerCxn.Factory:0.0.0.0/0.0.0.0:11221:NIOServerCnxnFactory@197]
- Accepted socket connection from /127.0.0.1:43691
    [junit] 2013-11-20 08:50:57,719 [myid:] - INFO  [NIOServerCxn.Factory:0.0.0.0/0.0.0.0:11221:NIOServerCnxn@817]
- Processing stat command from /127.0.0.1:43691
    [junit] 2013-11-20 08:50:57,720 [myid:] - INFO  [Thread-5:NIOServerCnxn$StatCommand@653]
- Stat command output
    [junit] 2013-11-20 08:50:57,720 [myid:] - INFO  [Thread-5:NIOServerCnxn@997] - Closed
socket connection for client /127.0.0.1:43691 (no session established for client)
    [junit] 2013-11-20 08:50:57,720 [myid:] - INFO  [main:JMXEnv@133] - ensureOnly:[InMemoryDataTree,
StandaloneServer_port]
    [junit] 2013-11-20 08:50:57,721 [myid:] - INFO  [main:JMXEnv@105] - expect:InMemoryDataTree
    [junit] 2013-11-20 08:50:57,722 [myid:] - INFO  [main:JMXEnv@108] - found:InMemoryDataTree
org.apache.ZooKeeperService:name0=StandaloneServer_port-1,name1=InMemoryDataTree
    [junit] 2013-11-20 08:50:57,722 [myid:] - INFO  [main:JMXEnv@105] - expect:StandaloneServer_port
    [junit] 2013-11-20 08:50:57,722 [myid:] - INFO  [main:JMXEnv@108] - found:StandaloneServer_port
org.apache.ZooKeeperService:name0=StandaloneServer_port-1
    [junit] 2013-11-20 08:50:57,722 [myid:] - INFO  [main:JUnit4ZKTestRunner$LoggedInvokeMethod@57]
- FINISHED TEST METHOD testQuota
    [junit] 2013-11-20 08:50:57,723 [myid:] - INFO  [main:ClientBase@451] - tearDown starting
    [junit] 2013-11-20 08:50:57,798 [myid:] - INFO  [main:ZooKeeper@684] - Session: 0x14274b487790000
closed
    [junit] 2013-11-20 08:50:57,798 [myid:] - INFO  [main-EventThread:ClientCnxn$EventThread@509]
- EventThread shut down
    [junit] 2013-11-20 08:50:57,798 [myid:] - INFO  [main:ClientBase@421] - STOPPING server
    [junit] 2013-11-20 08:50:57,798 [myid:] - INFO  [NIOServerCxn.Factory:0.0.0.0/0.0.0.0:11221:NIOServerCnxnFactory@224]
- NIOServerCnxn factory exited run method
    [junit] 2013-11-20 08:50:57,799 [myid:] - INFO  [main:ZooKeeperServer@441] - shutting
down
    [junit] 2013-11-20 08:50:57,799 [myid:] - INFO  [main:SessionTrackerImpl@225] - Shutting
down
    [junit] 2013-11-20 08:50:57,799 [myid:] - INFO  [main:PrepRequestProcessor@761] - Shutting
down
    [junit] 2013-11-20 08:50:57,799 [myid:] - INFO  [main:SyncRequestProcessor@209] - Shutting
down
    [junit] 2013-11-20 08:50:57,799 [myid:] - INFO  [ProcessThread(sid:0 cport:-1)::PrepRequestProcessor@143]
- PrepRequestProcessor exited loop!
    [junit] 2013-11-20 08:50:57,799 [myid:] - INFO  [SyncThread:0:SyncRequestProcessor@187]
- SyncRequestProcessor exited!
    [junit] 2013-11-20 08:50:57,800 [myid:] - INFO  [main:FinalRequestProcessor@415] - shutdown
of request processor complete
    [junit] 2013-11-20 08:50:57,800 [myid:] - INFO  [main:FourLetterWordMain@43] - connecting
to 127.0.0.1 11221
    [junit] 2013-11-20 08:50:57,801 [myid:] - INFO  [main:JMXEnv@133] - ensureOnly:[]
    [junit] 2013-11-20 08:50:57,804 [myid:] - INFO  [main:ClientBase@476] - fdcount after
test is: 38 at start it was 25
    [junit] 2013-11-20 08:50:57,804 [myid:] - INFO  [main:ClientBase@478] - sleeping for 20
secs
    [junit] 2013-11-20 08:50:57,804 [myid:] - INFO  [main:ZKTestCase$1@60] - SUCCEEDED testQuota
    [junit] 2013-11-20 08:50:57,805 [myid:] - INFO  [main:ZKTestCase$1@55] - FINISHED testQuota
    [junit] Tests run: 1, Failures: 0, Errors: 0, Time elapsed: 0.523 sec

BUILD FAILED
/home/jenkins/jenkins-slave/workspace/ZooKeeper_branch34/branch-3.4/build.xml:1340: The following
error occurred while executing this line:
/home/jenkins/jenkins-slave/workspace/ZooKeeper_branch34/branch-3.4/build.xml:1251: Tests
failed!

Total time: 18 minutes 59 seconds
Build step 'Execute shell' marked build as failure
Recording test results
Email was triggered for: Failure
Sending email for trigger: Failure



###################################################################################
############################## FAILED TESTS (if any) ##############################
2 tests failed.
REGRESSION:  org.apache.zookeeper.server.ZxidRolloverTest.testMultipleRollover

Error Message:
KeeperErrorCode = Session expired for /foofoofoo-connected

Stack Trace:
org.apache.zookeeper.KeeperException$SessionExpiredException: KeeperErrorCode = Session expired
for /foofoofoo-connected
	at org.apache.zookeeper.KeeperException.create(KeeperException.java:127)
	at org.apache.zookeeper.KeeperException.create(KeeperException.java:51)
	at org.apache.zookeeper.ZooKeeper.exists(ZooKeeper.java:1041)
	at org.apache.zookeeper.ZooKeeper.exists(ZooKeeper.java:1069)
	at org.apache.zookeeper.server.ZxidRolloverTest.checkClientConnected(ZxidRolloverTest.java:103)
	at org.apache.zookeeper.server.ZxidRolloverTest.checkClientsConnected(ZxidRolloverTest.java:88)
	at org.apache.zookeeper.server.ZxidRolloverTest.startAll(ZxidRolloverTest.java:152)
	at org.apache.zookeeper.server.ZxidRolloverTest.testMultipleRollover(ZxidRolloverTest.java:425)


REGRESSION:  org.apache.zookeeper.test.FollowerResyncConcurrencyTest.testResyncBySnapThenDiffAfterFollowerCrashes

Error Message:
Forked Java VM exited abnormally. Please note the time in the report does not reflect the
time until the VM exit.

Stack Trace:
junit.framework.AssertionFailedError: Forked Java VM exited abnormally. Please note the time
in the report does not reflect the time until the VM exit.



Mime
  • Unnamed multipart/mixed (inline, None, 0 bytes)
View raw message