zookeeper-dev mailing list archives

Site index · List index
Message view « Date » · « Thread »
Top « Date » · « Thread »
From Apache Jenkins Server <jenk...@builds.apache.org>
Subject ZooKeeper-trunk - Build # 2110 - Failure
Date Mon, 04 Nov 2013 12:19:14 GMT
See https://builds.apache.org/job/ZooKeeper-trunk/2110/

###################################################################################
########################## LAST 60 LINES OF THE CONSOLE ###########################
[...truncated 310215 lines...]
    [junit] 2013-11-04 12:14:39,783 [myid:] - INFO  [ProcessThread(sid:0 cport:-1)::PrepRequestProcessor@156]
- PrepRequestProcessor exited loop!
    [junit] 2013-11-04 12:14:39,784 [myid:] - INFO  [SyncThread:0:SyncRequestProcessor@168]
- SyncRequestProcessor exited!
    [junit] 2013-11-04 12:14:39,784 [myid:] - INFO  [main:FinalRequestProcessor@442] - shutdown
of request processor complete
    [junit] 2013-11-04 12:14:39,784 [myid:] - INFO  [main:FourLetterWordMain@43] - connecting
to 127.0.0.1 11221
    [junit] 2013-11-04 12:14:39,785 [myid:] - INFO  [main:JMXEnv@133] - ensureOnly:[]
    [junit] 2013-11-04 12:14:39,786 [myid:] - INFO  [main:ClientBase@414] - STARTING server
    [junit] 2013-11-04 12:14:39,786 [myid:] - INFO  [main:ZooKeeperServer@149] - Created server
with tickTime 3000 minSessionTimeout 6000 maxSessionTimeout 60000 datadir /home/jenkins/jenkins-slave/workspace/ZooKeeper-trunk/trunk/build/test/tmp/test7233425283476512048.junit.dir/version-2
snapdir /home/jenkins/jenkins-slave/workspace/ZooKeeper-trunk/trunk/build/test/tmp/test7233425283476512048.junit.dir/version-2
    [junit] 2013-11-04 12:14:39,787 [myid:] - INFO  [main:NIOServerCnxnFactory@670] - Configuring
NIO connection handler with 10s sessionless connection timeout, 2 selector thread(s), 16 worker
threads, and 64 kB direct buffers.
    [junit] 2013-11-04 12:14:39,787 [myid:] - INFO  [main:NIOServerCnxnFactory@683] - binding
to port 0.0.0.0/0.0.0.0:11221
    [junit] 2013-11-04 12:14:39,788 [myid:] - INFO  [main:FileSnap@83] - Reading snapshot
/home/jenkins/jenkins-slave/workspace/ZooKeeper-trunk/trunk/build/test/tmp/test7233425283476512048.junit.dir/version-2/snapshot.b
    [junit] 2013-11-04 12:14:39,791 [myid:] - INFO  [main:FileTxnSnapLog@297] - Snapshotting:
0xb to /home/jenkins/jenkins-slave/workspace/ZooKeeper-trunk/trunk/build/test/tmp/test7233425283476512048.junit.dir/version-2/snapshot.b
    [junit] 2013-11-04 12:14:39,793 [myid:] - INFO  [main:FourLetterWordMain@43] - connecting
to 127.0.0.1 11221
    [junit] 2013-11-04 12:14:39,793 [myid:] - INFO  [NIOServerCxnFactory.AcceptThread:0.0.0.0/0.0.0.0:11221:NIOServerCnxnFactory$AcceptThread@296]
- Accepted socket connection from /127.0.0.1:37685
    [junit] 2013-11-04 12:14:39,794 [myid:] - INFO  [NIOWorkerThread-1:NIOServerCnxn@828]
- Processing stat command from /127.0.0.1:37685
    [junit] 2013-11-04 12:14:39,794 [myid:] - INFO  [NIOWorkerThread-1:NIOServerCnxn$StatCommand@677]
- Stat command output
    [junit] 2013-11-04 12:14:39,795 [myid:] - INFO  [NIOWorkerThread-1:NIOServerCnxn@999]
- Closed socket connection for client /127.0.0.1:37685 (no session established for client)
    [junit] 2013-11-04 12:14:39,795 [myid:] - INFO  [main:JMXEnv@133] - ensureOnly:[InMemoryDataTree,
StandaloneServer_port]
    [junit] 2013-11-04 12:14:39,803 [myid:] - INFO  [main:JMXEnv@105] - expect:InMemoryDataTree
    [junit] 2013-11-04 12:14:39,803 [myid:] - INFO  [main:JMXEnv@108] - found:InMemoryDataTree
org.apache.ZooKeeperService:name0=StandaloneServer_port-1,name1=InMemoryDataTree
    [junit] 2013-11-04 12:14:39,803 [myid:] - INFO  [main:JMXEnv@105] - expect:StandaloneServer_port
    [junit] 2013-11-04 12:14:39,803 [myid:] - INFO  [main:JMXEnv@108] - found:StandaloneServer_port
org.apache.ZooKeeperService:name0=StandaloneServer_port-1
    [junit] 2013-11-04 12:14:39,804 [myid:] - INFO  [main:JUnit4ZKTestRunner$LoggedInvokeMethod@57]
- FINISHED TEST METHOD testQuota
    [junit] 2013-11-04 12:14:39,804 [myid:] - INFO  [main:ClientBase@451] - tearDown starting
    [junit] 2013-11-04 12:14:39,864 [myid:] - INFO  [main-EventThread:ClientCnxn$EventThread@513]
- EventThread shut down
    [junit] 2013-11-04 12:14:39,864 [myid:] - INFO  [main:ZooKeeper@777] - Session: 0x142230945960000
closed
    [junit] 2013-11-04 12:14:39,864 [myid:] - INFO  [main:ClientBase@421] - STOPPING server
    [junit] 2013-11-04 12:14:39,864 [myid:] - INFO  [ConnnectionExpirer:NIOServerCnxnFactory$ConnectionExpirerThread@583]
- ConnnectionExpirerThread interrupted
    [junit] 2013-11-04 12:14:39,864 [myid:] - INFO  [NIOServerCxnFactory.SelectorThread-1:NIOServerCnxnFactory$SelectorThread@420]
- selector thread exitted run method
    [junit] 2013-11-04 12:14:39,864 [myid:] - INFO  [NIOServerCxnFactory.AcceptThread:0.0.0.0/0.0.0.0:11221:NIOServerCnxnFactory$AcceptThread@219]
- accept thread exitted run method
    [junit] 2013-11-04 12:14:39,864 [myid:] - INFO  [NIOServerCxnFactory.SelectorThread-0:NIOServerCnxnFactory$SelectorThread@420]
- selector thread exitted run method
    [junit] 2013-11-04 12:14:39,865 [myid:] - INFO  [main:ZooKeeperServer@428] - shutting
down
    [junit] 2013-11-04 12:14:39,865 [myid:] - INFO  [main:SessionTrackerImpl@183] - Shutting
down
    [junit] 2013-11-04 12:14:39,865 [myid:] - INFO  [main:PrepRequestProcessor@972] - Shutting
down
    [junit] 2013-11-04 12:14:39,866 [myid:] - INFO  [main:SyncRequestProcessor@190] - Shutting
down
    [junit] 2013-11-04 12:14:39,866 [myid:] - INFO  [ProcessThread(sid:0 cport:-1)::PrepRequestProcessor@156]
- PrepRequestProcessor exited loop!
    [junit] 2013-11-04 12:14:39,866 [myid:] - INFO  [SyncThread:0:SyncRequestProcessor@168]
- SyncRequestProcessor exited!
    [junit] 2013-11-04 12:14:39,866 [myid:] - INFO  [main:FinalRequestProcessor@442] - shutdown
of request processor complete
    [junit] 2013-11-04 12:14:39,867 [myid:] - INFO  [main:FourLetterWordMain@43] - connecting
to 127.0.0.1 11221
    [junit] 2013-11-04 12:14:39,867 [myid:] - INFO  [main:JMXEnv@133] - ensureOnly:[]
    [junit] 2013-11-04 12:14:39,871 [myid:] - INFO  [main:ClientBase@476] - fdcount after
test is: 41 at start it was 28
    [junit] 2013-11-04 12:14:39,871 [myid:] - INFO  [main:ClientBase@478] - sleeping for 20
secs
    [junit] 2013-11-04 12:14:39,872 [myid:] - INFO  [main:ZKTestCase$1@61] - SUCCEEDED testQuota
    [junit] 2013-11-04 12:14:39,872 [myid:] - INFO  [main:ZKTestCase$1@56] - FINISHED testQuota
    [junit] Tests run: 1, Failures: 0, Errors: 0, Time elapsed: 0.694 sec

BUILD FAILED
/home/jenkins/jenkins-slave/workspace/ZooKeeper-trunk/trunk/build.xml:1353: The following
error occurred while executing this line:
/home/jenkins/jenkins-slave/workspace/ZooKeeper-trunk/trunk/build.xml:1264: Tests failed!

Total time: 31 minutes 50 seconds
Build step 'Execute shell' marked build as failure
[FINDBUGS] Skipping publisher since build result is FAILURE
[WARNINGS] Skipping publisher since build result is FAILURE
Archiving artifacts
Recording fingerprints
Recording test results
Publishing Javadoc
Email was triggered for: Failure
Sending email for trigger: Failure



###################################################################################
############################## FAILED TESTS (if any) ##############################
1 tests failed.
REGRESSION:  org.apache.zookeeper.test.LETest.testLE

Error Message:
Threads didn't join

Stack Trace:
junit.framework.AssertionFailedError: Threads didn't join
	at org.apache.zookeeper.test.LETest.testLE(LETest.java:123)
	at org.apache.zookeeper.JUnit4ZKTestRunner$LoggedInvokeMethod.evaluate(JUnit4ZKTestRunner.java:52)



Mime
  • Unnamed multipart/mixed (inline, None, 0 bytes)
View raw message