zookeeper-dev mailing list archives

Site index · List index
Message view « Date » · « Thread »
Top « Date » · « Thread »
From Apache Jenkins Server <jenk...@builds.apache.org>
Subject ZooKeeper-3.4-WinVS2008_java - Build # 341 - Still Failing
Date Sat, 02 Nov 2013 10:25:24 GMT
See https://builds.apache.org/job/ZooKeeper-3.4-WinVS2008_java/341/

###################################################################################
########################## LAST 60 LINES OF THE CONSOLE ###########################
[...truncated 206108 lines...]
    [junit] 2013-11-02 10:25:20,210 [myid:] - INFO  [NIOServerCxn.Factory:0.0.0.0/0.0.0.0:11221:NIOServerCnxnFactory@224]
- NIOServerCnxn factory exited run method
    [junit] 2013-11-02 10:25:20,125 [myid:] - INFO  [main-EventThread:ClientCnxn$EventThread@509]
- EventThread shut down
    [junit] 2013-11-02 10:25:20,210 [myid:] - INFO  [main:ZooKeeperServer@441] - shutting
down
    [junit] 2013-11-02 10:25:20,211 [myid:] - INFO  [main:SessionTrackerImpl@225] - Shutting
down
    [junit] 2013-11-02 10:25:20,211 [myid:] - INFO  [main:PrepRequestProcessor@761] - Shutting
down
    [junit] 2013-11-02 10:25:20,310 [myid:] - INFO  [main:SyncRequestProcessor@209] - Shutting
down
    [junit] 2013-11-02 10:25:20,310 [myid:] - INFO  [ProcessThread(sid:0 cport:-1)::PrepRequestProcessor@143]
- PrepRequestProcessor exited loop!
    [junit] 2013-11-02 10:25:20,310 [myid:] - INFO  [SyncThread:0:SyncRequestProcessor@187]
- SyncRequestProcessor exited!
    [junit] 2013-11-02 10:25:20,310 [myid:] - INFO  [main:FinalRequestProcessor@415] - shutdown
of request processor complete
    [junit] 2013-11-02 10:25:20,312 [myid:] - INFO  [main:FourLetterWordMain@43] - connecting
to 127.0.0.1 11221
    [junit] 2013-11-02 10:25:21,000 [myid:] - INFO  [SessionTracker:SessionTrackerImpl@162]
- SessionTrackerImpl exited loop!
    [junit] 2013-11-02 10:25:21,001 [myid:] - INFO  [SessionTracker:SessionTrackerImpl@162]
- SessionTrackerImpl exited loop!
    [junit] 2013-11-02 10:25:21,309 [myid:] - INFO  [main:JMXEnv@133] - ensureOnly:[]
    [junit] 2013-11-02 10:25:21,313 [myid:] - INFO  [main:ZKTestCase$1@65] - FAILED testQuota
    [junit] junit.framework.AssertionFailedError: expected:<0> but was:<1>
    [junit] 	at junit.framework.Assert.fail(Assert.java:47)
    [junit] 	at junit.framework.Assert.failNotEquals(Assert.java:283)
    [junit] 	at junit.framework.Assert.assertEquals(Assert.java:64)
    [junit] 	at junit.framework.Assert.assertEquals(Assert.java:195)
    [junit] 	at junit.framework.Assert.assertEquals(Assert.java:201)
    [junit] 	at org.apache.zookeeper.test.JMXEnv.ensureOnly(JMXEnv.java:138)
    [junit] 	at org.apache.zookeeper.test.ClientBase.startServer(ClientBase.java:417)
    [junit] 	at org.apache.zookeeper.test.ZooKeeperQuotaTest.testQuota(ZooKeeperQuotaTest.java:80)
    [junit] 	at sun.reflect.NativeMethodAccessorImpl.invoke0(Native Method)
    [junit] 	at sun.reflect.NativeMethodAccessorImpl.invoke(NativeMethodAccessorImpl.java:39)
    [junit] 	at sun.reflect.DelegatingMethodAccessorImpl.invoke(DelegatingMethodAccessorImpl.java:25)
    [junit] 	at java.lang.reflect.Method.invoke(Method.java:597)
    [junit] 	at org.junit.runners.model.FrameworkMethod$1.runReflectiveCall(FrameworkMethod.java:44)
    [junit] 	at org.junit.internal.runners.model.ReflectiveCallable.run(ReflectiveCallable.java:15)
    [junit] 	at org.junit.runners.model.FrameworkMethod.invokeExplosively(FrameworkMethod.java:41)
    [junit] 	at org.junit.internal.runners.statements.InvokeMethod.evaluate(InvokeMethod.java:20)
    [junit] 	at org.apache.zookeeper.JUnit4ZKTestRunner$LoggedInvokeMethod.evaluate(JUnit4ZKTestRunner.java:52)
    [junit] 	at org.junit.internal.runners.statements.RunBefores.evaluate(RunBefores.java:28)
    [junit] 	at org.junit.internal.runners.statements.RunAfters.evaluate(RunAfters.java:31)
    [junit] 	at org.junit.rules.TestWatchman$1.evaluate(TestWatchman.java:48)
    [junit] 	at org.junit.runners.BlockJUnit4ClassRunner.runChild(BlockJUnit4ClassRunner.java:76)
    [junit] 	at org.junit.runners.BlockJUnit4ClassRunner.runChild(BlockJUnit4ClassRunner.java:50)
    [junit] 	at org.junit.runners.ParentRunner$3.run(ParentRunner.java:193)
    [junit] 	at org.junit.runners.ParentRunner$1.schedule(ParentRunner.java:52)
    [junit] 	at org.junit.runners.ParentRunner.runChildren(ParentRunner.java:191)
    [junit] 	at org.junit.runners.ParentRunner.access$000(ParentRunner.java:42)
    [junit] 	at org.junit.runners.ParentRunner$2.evaluate(ParentRunner.java:184)
    [junit] 	at org.junit.runners.ParentRunner.run(ParentRunner.java:236)
    [junit] 	at junit.framework.JUnit4TestAdapter.run(JUnit4TestAdapter.java:39)
    [junit] 	at org.apache.tools.ant.taskdefs.optional.junit.JUnitTestRunner.run(JUnitTestRunner.java:518)
    [junit] 	at org.apache.tools.ant.taskdefs.optional.junit.JUnitTestRunner.launch(JUnitTestRunner.java:1052)
    [junit] 	at org.apache.tools.ant.taskdefs.optional.junit.JUnitTestRunner.main(JUnitTestRunner.java:906)
    [junit] 2013-11-02 10:25:21,317 [myid:] - INFO  [main:ZKTestCase$1@55] - FINISHED testQuota
    [junit] Tests run: 1, Failures: 1, Errors: 0, Time elapsed: 5.241 sec
    [junit] Test org.apache.zookeeper.test.ZooKeeperQuotaTest FAILED

BUILD FAILED
f:\hudson\hudson-slave\workspace\ZooKeeper-3.4-WinVS2008_java\branch-3.4\build.xml:1251: Tests
failed!

Total time: 113 minutes 4 seconds
Build step 'Invoke Ant' marked build as failure
Recording test results
Email was triggered for: Failure
Sending email for trigger: Failure



###################################################################################
############################## FAILED TESTS (if any) ##############################
No tests ran.
Mime
  • Unnamed multipart/mixed (inline, None, 0 bytes)
View raw message