zookeeper-dev mailing list archives

Site index · List index
Message view « Date » · « Thread »
Top « Date » · « Thread »
From Apache Jenkins Server <jenk...@builds.apache.org>
Subject ZooKeeper_branch33_solaris - Build # 658 - Still Failing
Date Thu, 26 Sep 2013 07:08:46 GMT
See https://builds.apache.org/job/ZooKeeper_branch33_solaris/658/

###################################################################################
########################## LAST 60 LINES OF THE CONSOLE ###########################
[...truncated 103156 lines...]
    [junit] 2013-09-26 07:07:32,665 - INFO  [main:ZooKeeperServer@154] - Created server with
tickTime 3000 minSessionTimeout 6000 maxSessionTimeout 60000 datadir /zonestorage/hudson_solaris/home/hudson/hudson-slave/workspace/ZooKeeper_branch33_solaris/trunk/build/test/tmp/test7741523848411877401.junit.dir/version-2
snapdir /zonestorage/hudson_solaris/home/hudson/hudson-slave/workspace/ZooKeeper_branch33_solaris/trunk/build/test/tmp/test7741523848411877401.junit.dir/version-2
    [junit] 2013-09-26 07:07:32,666 - INFO  [main:NIOServerCnxn$Factory@143] - binding to
port 0.0.0.0/0.0.0.0:11221
    [junit] 2013-09-26 07:07:32,668 - INFO  [main:FileSnap@82] - Reading snapshot /zonestorage/hudson_solaris/home/hudson/hudson-slave/workspace/ZooKeeper_branch33_solaris/trunk/build/test/tmp/test7741523848411877401.junit.dir/version-2/snapshot.0
    [junit] 2013-09-26 07:07:32,674 - INFO  [main:FileTxnSnapLog@256] - Snapshotting: b
    [junit] 2013-09-26 07:07:32,678 - INFO  [main:FourLetterWordMain@43] - connecting to 127.0.0.1
11221
    [junit] 2013-09-26 07:07:32,680 - INFO  [NIOServerCxn.Factory:0.0.0.0/0.0.0.0:11221:NIOServerCnxn$Factory@251]
- Accepted socket connection from /127.0.0.1:37614
    [junit] 2013-09-26 07:07:32,680 - INFO  [NIOServerCxn.Factory:0.0.0.0/0.0.0.0:11221:NIOServerCnxn@1237]
- Processing stat command from /127.0.0.1:37614
    [junit] 2013-09-26 07:07:32,681 - INFO  [Thread-4:NIOServerCnxn$StatCommand@1153] - Stat
command output
    [junit] 2013-09-26 07:07:32,682 - INFO  [Thread-4:NIOServerCnxn@1435] - Closed socket
connection for client /127.0.0.1:37614 (no session established for client)
    [junit] ensureOnly:[InMemoryDataTree, StandaloneServer_port]
    [junit] expect:InMemoryDataTree
    [junit] found:InMemoryDataTree org.apache.ZooKeeperService:name0=StandaloneServer_port-1,name1=InMemoryDataTree
    [junit] expect:StandaloneServer_port
    [junit] found:StandaloneServer_port org.apache.ZooKeeperService:name0=StandaloneServer_port-1
    [junit] 2013-09-26 07:07:32,684 - INFO  [main:ClientBase@408] - STOPPING server
    [junit] 2013-09-26 07:07:32,686 - INFO  [ProcessThread:-1:PrepRequestProcessor@128] -
PrepRequestProcessor exited loop!
    [junit] 2013-09-26 07:07:32,686 - INFO  [SyncThread:0:SyncRequestProcessor@151] - SyncRequestProcessor
exited!
    [junit] 2013-09-26 07:07:32,687 - INFO  [main:FinalRequestProcessor@370] - shutdown of
request processor complete
    [junit] 2013-09-26 07:07:32,688 - INFO  [main:FourLetterWordMain@43] - connecting to 127.0.0.1
11221
    [junit] ensureOnly:[]
    [junit] 2013-09-26 07:07:32,691 - INFO  [main:ClientBase@401] - STARTING server
    [junit] 2013-09-26 07:07:32,692 - INFO  [main:ZooKeeperServer@154] - Created server with
tickTime 3000 minSessionTimeout 6000 maxSessionTimeout 60000 datadir /zonestorage/hudson_solaris/home/hudson/hudson-slave/workspace/ZooKeeper_branch33_solaris/trunk/build/test/tmp/test7741523848411877401.junit.dir/version-2
snapdir /zonestorage/hudson_solaris/home/hudson/hudson-slave/workspace/ZooKeeper_branch33_solaris/trunk/build/test/tmp/test7741523848411877401.junit.dir/version-2
    [junit] 2013-09-26 07:07:32,693 - INFO  [main:NIOServerCnxn$Factory@143] - binding to
port 0.0.0.0/0.0.0.0:11221
    [junit] 2013-09-26 07:07:32,694 - INFO  [main:FileSnap@82] - Reading snapshot /zonestorage/hudson_solaris/home/hudson/hudson-slave/workspace/ZooKeeper_branch33_solaris/trunk/build/test/tmp/test7741523848411877401.junit.dir/version-2/snapshot.b
    [junit] 2013-09-26 07:07:32,697 - INFO  [main:FileTxnSnapLog@256] - Snapshotting: b
    [junit] 2013-09-26 07:07:32,699 - INFO  [main:FourLetterWordMain@43] - connecting to 127.0.0.1
11221
    [junit] 2013-09-26 07:07:32,700 - INFO  [NIOServerCxn.Factory:0.0.0.0/0.0.0.0:11221:NIOServerCnxn$Factory@251]
- Accepted socket connection from /127.0.0.1:37616
    [junit] 2013-09-26 07:07:32,701 - INFO  [NIOServerCxn.Factory:0.0.0.0/0.0.0.0:11221:NIOServerCnxn@1237]
- Processing stat command from /127.0.0.1:37616
    [junit] 2013-09-26 07:07:32,702 - INFO  [Thread-5:NIOServerCnxn$StatCommand@1153] - Stat
command output
    [junit] 2013-09-26 07:07:32,703 - INFO  [Thread-5:NIOServerCnxn@1435] - Closed socket
connection for client /127.0.0.1:37616 (no session established for client)
    [junit] ensureOnly:[InMemoryDataTree, StandaloneServer_port]
    [junit] expect:InMemoryDataTree
    [junit] found:InMemoryDataTree org.apache.ZooKeeperService:name0=StandaloneServer_port-1,name1=InMemoryDataTree
    [junit] expect:StandaloneServer_port
    [junit] found:StandaloneServer_port org.apache.ZooKeeperService:name0=StandaloneServer_port-1
    [junit] 2013-09-26 07:07:32,705 - INFO  [main:ClientBase@431] - tearDown starting
    [junit] 2013-09-26 07:07:32,705 - INFO  [main:ClientBase@443] - fdcount after test is:
41
    [junit] 2013-09-26 07:07:32,762 - INFO  [main:ZooKeeper@544] - Session: 0x141591814520000
closed
    [junit] 2013-09-26 07:07:32,763 - INFO  [main:ClientBase@408] - STOPPING server
    [junit] 2013-09-26 07:07:32,765 - INFO  [ProcessThread:-1:PrepRequestProcessor@128] -
PrepRequestProcessor exited loop!
    [junit] 2013-09-26 07:07:32,762 - INFO  [main-EventThread:ClientCnxn$EventThread@516]
- EventThread shut down
    [junit] 2013-09-26 07:07:32,765 - INFO  [SyncThread:0:SyncRequestProcessor@151] - SyncRequestProcessor
exited!
    [junit] 2013-09-26 07:07:32,767 - INFO  [main:FinalRequestProcessor@370] - shutdown of
request processor complete
    [junit] 2013-09-26 07:07:32,768 - INFO  [main:FourLetterWordMain@43] - connecting to 127.0.0.1
11221
    [junit] ensureOnly:[]
    [junit] 2013-09-26 07:07:32,774 - INFO  [main:ClientBase@460] - FINISHED testQuota
    [junit] 2013-09-26 07:07:32,774 - INFO  [main:ZooKeeperQuotaTest@52] - STOPPING org.apache.zookeeper.test.ZooKeeperQuotaTest
    [junit] Tests run: 1, Failures: 0, Errors: 0, Time elapsed: 2.471 sec

BUILD FAILED
/zonestorage/hudson_solaris/home/hudson/hudson-slave/workspace/ZooKeeper_branch33_solaris/trunk/build.xml:845:
Tests failed!

Total time: 26 minutes 17 seconds
Build step 'Invoke Ant' marked build as failure
[locks-and-latches] Releasing all the locks
[locks-and-latches] All the locks released
Recording test results
Email was triggered for: Failure
Sending email for trigger: Failure



###################################################################################
############################## FAILED TESTS (if any) ##############################
3 tests failed.
REGRESSION:  org.apache.zookeeper.test.QuorumTest.testSessionMove

Error Message:
KeeperErrorCode = ConnectionLoss for /t-7

Stack Trace:
org.apache.zookeeper.KeeperException$ConnectionLossException: KeeperErrorCode = ConnectionLoss
for /t-7
	at org.apache.zookeeper.KeeperException.create(KeeperException.java:90)
	at org.apache.zookeeper.KeeperException.create(KeeperException.java:42)
	at org.apache.zookeeper.ZooKeeper.create(ZooKeeper.java:643)
	at org.apache.zookeeper.test.QuorumTest.testSessionMove(QuorumTest.java:258)


REGRESSION:  org.apache.zookeeper.test.SessionTest.testSessionMove

Error Message:
Should have lost the connection

Stack Trace:
junit.framework.AssertionFailedError: Should have lost the connection
	at org.apache.zookeeper.test.SessionTest.testSessionMove(SessionTest.java:308)


FAILED:  org.apache.zookeeper.test.QuorumTest.testSessionMoved

Error Message:
KeeperErrorCode = ConnectionLoss for /

Stack Trace:
org.apache.zookeeper.KeeperException$ConnectionLossException: KeeperErrorCode = ConnectionLoss
for /
	at org.apache.zookeeper.KeeperException.create(KeeperException.java:90)
	at org.apache.zookeeper.KeeperException.create(KeeperException.java:42)
	at org.apache.zookeeper.ZooKeeper.setData(ZooKeeper.java:1044)
	at org.apache.zookeeper.test.QuorumTest.testSessionMoved(QuorumTest.java:198)



Mime
  • Unnamed multipart/mixed (inline, None, 0 bytes)
View raw message