zookeeper-dev mailing list archives

Site index · List index
Message view « Date » · « Thread »
Top « Date » · « Thread »
From Apache Jenkins Server <jenk...@builds.apache.org>
Subject ZooKeeper_branch33_solaris - Build # 635 - Failure
Date Tue, 03 Sep 2013 06:36:38 GMT
See https://builds.apache.org/job/ZooKeeper_branch33_solaris/635/

###################################################################################
########################## LAST 60 LINES OF THE CONSOLE ###########################
Started by timer
Building remotely on solaris1 in workspace /export/home/hudson/hudson-slave/workspace/ZooKeeper_branch33_solaris
FATAL: hudson.remoting.RequestAbortedException: hudson.remoting.Channel$OrderlyShutdown
hudson.remoting.RequestAbortedException: hudson.remoting.RequestAbortedException: hudson.remoting.Channel$OrderlyShutdown
	at hudson.remoting.RequestAbortedException.wrapForRethrow(RequestAbortedException.java:41)
	at hudson.remoting.RequestAbortedException.wrapForRethrow(RequestAbortedException.java:34)
	at hudson.remoting.Request.call(Request.java:174)
	at hudson.remoting.Channel.call(Channel.java:714)
	at hudson.EnvVars.getRemote(EnvVars.java:212)
	at hudson.model.Computer.getEnvironment(Computer.java:909)
	at jenkins.model.CoreEnvironmentContributor.buildEnvironmentFor(CoreEnvironmentContributor.java:40)
	at hudson.model.Job.getEnvironment(Job.java:374)
	at hudson.model.AbstractProject.getEnvironment(AbstractProject.java:353)
	at hudson.model.Run.getEnvironment(Run.java:2111)
	at hudson.model.AbstractBuild.getEnvironment(AbstractBuild.java:911)
	at hudson.scm.SubversionSCM.checkout(SubversionSCM.java:776)
	at hudson.model.AbstractProject.checkout(AbstractProject.java:1408)
	at hudson.model.AbstractBuild$AbstractBuildExecution.defaultCheckout(AbstractBuild.java:657)
	at jenkins.scm.SCMCheckoutStrategy.checkout(SCMCheckoutStrategy.java:88)
	at hudson.model.AbstractBuild$AbstractBuildExecution.run(AbstractBuild.java:562)
	at hudson.model.Run.execute(Run.java:1603)
	at hudson.model.FreeStyleBuild.run(FreeStyleBuild.java:46)
	at hudson.model.ResourceController.execute(ResourceController.java:88)
	at hudson.model.Executor.run(Executor.java:247)
Caused by: hudson.remoting.RequestAbortedException: hudson.remoting.Channel$OrderlyShutdown
	at hudson.remoting.Request.abort(Request.java:299)
	at hudson.remoting.Channel.terminate(Channel.java:774)
	at hudson.remoting.Channel$CloseCommand.execute(Channel.java:919)
	at hudson.remoting.Channel$2.handle(Channel.java:461)
	at hudson.remoting.SynchronousCommandTransport$ReaderThread.run(SynchronousCommandTransport.java:60)
Caused by: hudson.remoting.Channel$OrderlyShutdown
	... 3 more
Caused by: Command close created at
	at hudson.remoting.Command.<init>(Command.java:56)
	at hudson.remoting.Channel$CloseCommand.<init>(Channel.java:913)
	at hudson.remoting.Channel$CloseCommand.<init>(Channel.java:911)
	at hudson.remoting.Channel.close(Channel.java:994)
	at hudson.remoting.Channel.close(Channel.java:977)
	at hudson.remoting.Channel$CloseCommand.execute(Channel.java:918)
	... 2 more



###################################################################################
############################## FAILED TESTS (if any) ##############################
No tests ran.
Mime
  • Unnamed multipart/mixed (inline, None, 0 bytes)
View raw message