zookeeper-dev mailing list archives

Site index · List index
Message view « Date » · « Thread »
Top « Date » · « Thread »
From Apache Jenkins Server <jenk...@builds.apache.org>
Subject Failed: ZOOKEEPER-1664 PreCommit Build #1557
Date Fri, 06 Sep 2013 14:12:51 GMT
Jira: https://issues.apache.org/jira/browse/ZOOKEEPER-1664
Build: https://builds.apache.org/job/PreCommit-ZOOKEEPER-Build/1557/

###################################################################################
########################## LAST 60 LINES OF THE CONSOLE ###########################
[...truncated 74 lines...]
     [exec] Hunk #2 FAILED at 213.
     [exec] Hunk #3 FAILED at 247.
     [exec] 3 out of 3 hunks FAILED -- saving rejects to file b/src/java/main/org/apache/zookeeper/client/ZooKeeperSaslClient.java.rej
     [exec] patching file b/src/java/main/org/apache/zookeeper/server/ZooKeeperSaslServer.java
     [exec] Hunk #1 FAILED at 21.
     [exec] Hunk #2 FAILED at 68.
     [exec] Hunk #3 FAILED at 80.
     [exec] 3 out of 3 hunks FAILED -- saving rejects to file b/src/java/main/org/apache/zookeeper/server/ZooKeeperSaslServer.java.rej
     [exec] PATCH APPLICATION FAILED
     [exec] 
     [exec] 
     [exec] 
     [exec] 
     [exec] -1 overall.  Here are the results of testing the latest attachment 
     [exec]   http://issues.apache.org/jira/secure/attachment/12573555/ZOOKEEPER-1664.patch
     [exec]   against trunk revision 1520436.
     [exec] 
     [exec]     +1 @author.  The patch does not contain any @author tags.
     [exec] 
     [exec]     -1 tests included.  The patch doesn't appear to include any new or modified
tests.
     [exec]                         Please justify why no new tests are needed for this patch.
     [exec]                         Also please list what manual steps were performed to verify
this patch.
     [exec] 
     [exec]     -1 patch.  The patch command could not apply the patch.
     [exec] 
     [exec] Console output: https://builds.apache.org/job/PreCommit-ZOOKEEPER-Build/1557//console
     [exec] 
     [exec] This message is automatically generated.
     [exec] 
     [exec] 
     [exec] ======================================================================
     [exec] ======================================================================
     [exec]     Adding comment to Jira.
     [exec] ======================================================================
     [exec] ======================================================================
     [exec] 
     [exec] 
     [exec] Comment added.
     [exec] 4c739fdc509dca30e0796bc98e5fa923976c933e logged out
     [exec] 
     [exec] 
     [exec] ======================================================================
     [exec] ======================================================================
     [exec]     Finished build.
     [exec] ======================================================================
     [exec] ======================================================================
     [exec] 
     [exec] 

BUILD FAILED
/home/jenkins/jenkins-slave/workspace/PreCommit-ZOOKEEPER-Build/trunk/build.xml:1623: exec
returned: 1

Total time: 42 seconds
Build step 'Execute shell' marked build as failure
Archiving artifacts
Recording test results
Description set: ZOOKEEPER-1664
Email was triggered for: Failure
Sending email for trigger: Failure



###################################################################################
############################## FAILED TESTS (if any) ##############################
No tests ran.
Mime
  • Unnamed multipart/mixed (inline, None, 0 bytes)
View raw message