zookeeper-dev mailing list archives

Site index · List index
Message view « Date » · « Thread »
Top « Date » · « Thread »
From Apache Jenkins Server <jenk...@builds.apache.org>
Subject Failed: ZOOKEEPER-1749 PreCommit Build #1552
Date Mon, 02 Sep 2013 16:52:47 GMT
Jira: https://issues.apache.org/jira/browse/ZOOKEEPER-1749
Build: https://builds.apache.org/job/PreCommit-ZOOKEEPER-Build/1552/

###################################################################################
########################## LAST 60 LINES OF THE CONSOLE ###########################
[...truncated 91 lines...]
     [exec] 1 out of 1 hunk FAILED -- saving rejects to file b/src/java/test/org/apache/zookeeper/TestableZooKeeper.java.rej
     [exec] patching file b/src/java/test/org/apache/zookeeper/test/ClientBase.java
     [exec] Hunk #1 FAILED at 45.
     [exec] Hunk #2 FAILED at 172.
     [exec] Hunk #3 FAILED at 195.
     [exec] 3 out of 3 hunks FAILED -- saving rejects to file b/src/java/test/org/apache/zookeeper/test/ClientBase.java.rej
     [exec] patching file b/src/java/test/org/apache/zookeeper/test/SaslAuthTest.java
     [exec] Hunk #1 FAILED at 25.
     [exec] Hunk #2 FAILED at 96.
     [exec] 2 out of 2 hunks FAILED -- saving rejects to file b/src/java/test/org/apache/zookeeper/test/SaslAuthTest.java.rej
     [exec] PATCH APPLICATION FAILED
     [exec] 
     [exec] 
     [exec] 
     [exec] 
     [exec] -1 overall.  Here are the results of testing the latest attachment 
     [exec]   http://issues.apache.org/jira/secure/attachment/12601075/ZOOKEEPER-1749.patch
     [exec]   against trunk revision 1516126.
     [exec] 
     [exec]     +1 @author.  The patch does not contain any @author tags.
     [exec] 
     [exec]     +1 tests included.  The patch appears to include 9 new or modified tests.
     [exec] 
     [exec]     -1 patch.  The patch command could not apply the patch.
     [exec] 
     [exec] Console output: https://builds.apache.org/job/PreCommit-ZOOKEEPER-Build/1552//console
     [exec] 
     [exec] This message is automatically generated.
     [exec] 
     [exec] 
     [exec] ======================================================================
     [exec] ======================================================================
     [exec]     Adding comment to Jira.
     [exec] ======================================================================
     [exec] ======================================================================
     [exec] 
     [exec] 
     [exec] Comment added.
     [exec] 013ded6015baac00561fd3703c5a408d2f2ee201 logged out
     [exec] 
     [exec] 
     [exec] ======================================================================
     [exec] ======================================================================
     [exec]     Finished build.
     [exec] ======================================================================
     [exec] ======================================================================
     [exec] 
     [exec] 

BUILD FAILED
/home/jenkins/jenkins-slave/workspace/PreCommit-ZOOKEEPER-Build/trunk/build.xml:1623: exec
returned: 1

Total time: 41 seconds
Build step 'Execute shell' marked build as failure
Archiving artifacts
Recording test results
Description set: ZOOKEEPER-1749
Email was triggered for: Failure
Sending email for trigger: Failure



###################################################################################
############################## FAILED TESTS (if any) ##############################
No tests ran.
Mime
  • Unnamed multipart/mixed (inline, None, 0 bytes)
View raw message