zookeeper-dev mailing list archives

Site index · List index
Message view « Date » · « Thread »
Top « Date » · « Thread »
From Apache Jenkins Server <jenk...@builds.apache.org>
Subject Failed: ZOOKEEPER-1754 PreCommit Build #1559
Date Fri, 06 Sep 2013 16:22:56 GMT
Jira: https://issues.apache.org/jira/browse/ZOOKEEPER-1754
Build: https://builds.apache.org/job/PreCommit-ZOOKEEPER-Build/1559/

###################################################################################
########################## LAST 60 LINES OF THE CONSOLE ###########################
[...truncated 1344 lines...]
     [exec]     Applying patch.
     [exec] ======================================================================
     [exec] ======================================================================
     [exec] 
     [exec] 
     [exec] patching file src/java/main/org/apache/zookeeper/server/quorum/ReadOnlyRequestProcessor.java
     [exec] Hunk #2 FAILED at 80.
     [exec] 1 out of 2 hunks FAILED -- saving rejects to file src/java/main/org/apache/zookeeper/server/quorum/ReadOnlyRequestProcessor.java.rej
     [exec] patching file src/java/test/org/apache/zookeeper/test/ReadOnlyModeTest.java
     [exec] PATCH APPLICATION FAILED
     [exec] 
     [exec] 
     [exec] 
     [exec] 
     [exec] -1 overall.  Here are the results of testing the latest attachment 
     [exec]   http://issues.apache.org/jira/secure/attachment/12601840/0001-ZOOKEEPER-1754-multitransaction-br-3_4.patch
     [exec]   against trunk revision 1520436.
     [exec] 
     [exec]     +1 @author.  The patch does not contain any @author tags.
     [exec] 
     [exec]     +1 tests included.  The patch appears to include 3 new or modified tests.
     [exec] 
     [exec]     -1 patch.  The patch command could not apply the patch.
     [exec] 
     [exec] Console output: https://builds.apache.org/job/PreCommit-ZOOKEEPER-Build/1559//console
     [exec] 
     [exec] This message is automatically generated.
     [exec] 
     [exec] 
     [exec] ======================================================================
     [exec] ======================================================================
     [exec]     Adding comment to Jira.
     [exec] ======================================================================
     [exec] ======================================================================
     [exec] 
     [exec] 
     [exec] Comment added.
     [exec] f7f0c3844e399e066c5968ed64edfd81fb32e021 logged out
     [exec] 
     [exec] 
     [exec] ======================================================================
     [exec] ======================================================================
     [exec]     Finished build.
     [exec] ======================================================================
     [exec] ======================================================================
     [exec] 
     [exec] 

BUILD FAILED
/home/jenkins/jenkins-slave/workspace/PreCommit-ZOOKEEPER-Build/trunk/build.xml:1623: exec
returned: 1

Total time: 46 seconds
Build step 'Execute shell' marked build as failure
Archiving artifacts
Recording test results
Description set: ZOOKEEPER-1754
Editable Email Notification is waiting for a checkpoint on PreCommit-ZOOKEEPER-Build #1558
Email was triggered for: Failure
Sending email for trigger: Failure



###################################################################################
############################## FAILED TESTS (if any) ##############################
No tests ran.
Mime
  • Unnamed multipart/mixed (inline, None, 0 bytes)
View raw message