zookeeper-dev mailing list archives

Site index · List index
Message view « Date » · « Thread »
Top « Date » · « Thread »
From Apache Jenkins Server <jenk...@builds.apache.org>
Subject ZooKeeper-trunk-jdk7 - Build # 340 - Still Failing
Date Wed, 01 Aug 2012 09:56:23 GMT
See https://builds.apache.org/job/ZooKeeper-trunk-jdk7/340/

###################################################################################
########################## LAST 60 LINES OF THE CONSOLE ###########################
[...truncated 250895 lines...]
    [junit] 2012-08-01 09:56:10,433 [myid:] - INFO  [main:ClientBase@421] - STOPPING server
    [junit] 2012-08-01 09:56:10,433 [myid:] - INFO  [NIOServerCxn.Factory:0.0.0.0/0.0.0.0:11221:NIOServerCnxnFactory@238]
- NIOServerCnxn factory exited run method
    [junit] 2012-08-01 09:56:10,434 [myid:] - INFO  [main:ZooKeeperServer@399] - shutting
down
    [junit] 2012-08-01 09:56:10,434 [myid:] - INFO  [main:SessionTrackerImpl@220] - Shutting
down
    [junit] 2012-08-01 09:56:10,434 [myid:] - INFO  [main:PrepRequestProcessor@733] - Shutting
down
    [junit] 2012-08-01 09:56:10,434 [myid:] - INFO  [ProcessThread(sid:0 cport:-1)::PrepRequestProcessor@142]
- PrepRequestProcessor exited loop!
    [junit] 2012-08-01 09:56:10,434 [myid:] - INFO  [main:SyncRequestProcessor@175] - Shutting
down
    [junit] 2012-08-01 09:56:10,434 [myid:] - INFO  [SyncThread:0:SyncRequestProcessor@155]
- SyncRequestProcessor exited!
    [junit] 2012-08-01 09:56:10,435 [myid:] - INFO  [main:FinalRequestProcessor@411] - shutdown
of request processor complete
    [junit] 2012-08-01 09:56:10,435 [myid:] - INFO  [main:FourLetterWordMain@43] - connecting
to 127.0.0.1 11221
    [junit] 2012-08-01 09:56:10,435 [myid:] - INFO  [main:JMXEnv@133] - ensureOnly:[]
    [junit] 2012-08-01 09:56:10,436 [myid:] - INFO  [main:ClientBase@414] - STARTING server
    [junit] 2012-08-01 09:56:10,436 [myid:] - INFO  [main:ZooKeeperServer@147] - Created server
with tickTime 3000 minSessionTimeout 6000 maxSessionTimeout 60000 datadir /home/jenkins/jenkins-slave/workspace/ZooKeeper-trunk-jdk7/trunk/build/test/tmp/test3188770441852319503.junit.dir/version-2
snapdir /home/jenkins/jenkins-slave/workspace/ZooKeeper-trunk-jdk7/trunk/build/test/tmp/test3188770441852319503.junit.dir/version-2
    [junit] 2012-08-01 09:56:10,437 [myid:] - INFO  [main:NIOServerCnxnFactory@108] - binding
to port 0.0.0.0/0.0.0.0:11221
    [junit] 2012-08-01 09:56:10,437 [myid:] - INFO  [main:FileSnap@83] - Reading snapshot
/home/jenkins/jenkins-slave/workspace/ZooKeeper-trunk-jdk7/trunk/build/test/tmp/test3188770441852319503.junit.dir/version-2/snapshot.b
    [junit] 2012-08-01 09:56:10,439 [myid:] - INFO  [main:FileTxnSnapLog@270] - Snapshotting:
0xb to /home/jenkins/jenkins-slave/workspace/ZooKeeper-trunk-jdk7/trunk/build/test/tmp/test3188770441852319503.junit.dir/version-2/snapshot.b
    [junit] 2012-08-01 09:56:10,440 [myid:] - INFO  [main:FourLetterWordMain@43] - connecting
to 127.0.0.1 11221
    [junit] 2012-08-01 09:56:10,441 [myid:] - INFO  [NIOServerCxn.Factory:0.0.0.0/0.0.0.0:11221:NIOServerCnxnFactory@211]
- Accepted socket connection from /127.0.0.1:50566
    [junit] 2012-08-01 09:56:10,441 [myid:] - INFO  [NIOServerCxn.Factory:0.0.0.0/0.0.0.0:11221:NIOServerCnxn@821]
- Processing stat command from /127.0.0.1:50566
    [junit] 2012-08-01 09:56:10,441 [myid:] - INFO  [Thread-4:NIOServerCnxn$StatCommand@655]
- Stat command output
    [junit] 2012-08-01 09:56:10,441 [myid:] - INFO  [Thread-4:NIOServerCnxn@1001] - Closed
socket connection for client /127.0.0.1:50566 (no session established for client)
    [junit] 2012-08-01 09:56:10,442 [myid:] - INFO  [main:JMXEnv@133] - ensureOnly:[InMemoryDataTree,
StandaloneServer_port]
    [junit] 2012-08-01 09:56:10,443 [myid:] - INFO  [main:JMXEnv@105] - expect:InMemoryDataTree
    [junit] 2012-08-01 09:56:10,443 [myid:] - INFO  [main:JMXEnv@108] - found:InMemoryDataTree
org.apache.ZooKeeperService:name0=StandaloneServer_port-1,name1=InMemoryDataTree
    [junit] 2012-08-01 09:56:10,443 [myid:] - INFO  [main:JMXEnv@105] - expect:StandaloneServer_port
    [junit] 2012-08-01 09:56:10,443 [myid:] - INFO  [main:JMXEnv@108] - found:StandaloneServer_port
org.apache.ZooKeeperService:name0=StandaloneServer_port-1
    [junit] 2012-08-01 09:56:10,444 [myid:] - INFO  [main:JUnit4ZKTestRunner$LoggedInvokeMethod@57]
- FINISHED TEST METHOD testQuota
    [junit] 2012-08-01 09:56:10,444 [myid:] - INFO  [main:ClientBase@451] - tearDown starting
    [junit] 2012-08-01 09:56:10,521 [myid:] - INFO  [main:ZooKeeper@679] - Session: 0x138e19d2b900000
closed
    [junit] 2012-08-01 09:56:10,522 [myid:] - INFO  [main:ClientBase@421] - STOPPING server
    [junit] 2012-08-01 09:56:10,522 [myid:] - INFO  [main-EventThread:ClientCnxn$EventThread@511]
- EventThread shut down
    [junit] 2012-08-01 09:56:10,522 [myid:] - INFO  [NIOServerCxn.Factory:0.0.0.0/0.0.0.0:11221:NIOServerCnxnFactory@238]
- NIOServerCnxn factory exited run method
    [junit] 2012-08-01 09:56:10,522 [myid:] - INFO  [main:ZooKeeperServer@399] - shutting
down
    [junit] 2012-08-01 09:56:10,523 [myid:] - INFO  [main:SessionTrackerImpl@220] - Shutting
down
    [junit] 2012-08-01 09:56:10,523 [myid:] - INFO  [main:PrepRequestProcessor@733] - Shutting
down
    [junit] 2012-08-01 09:56:10,523 [myid:] - INFO  [main:SyncRequestProcessor@175] - Shutting
down
    [junit] 2012-08-01 09:56:10,523 [myid:] - INFO  [SyncThread:0:SyncRequestProcessor@155]
- SyncRequestProcessor exited!
    [junit] 2012-08-01 09:56:10,523 [myid:] - INFO  [main:FinalRequestProcessor@411] - shutdown
of request processor complete
    [junit] 2012-08-01 09:56:10,523 [myid:] - INFO  [ProcessThread(sid:0 cport:-1)::PrepRequestProcessor@142]
- PrepRequestProcessor exited loop!
    [junit] 2012-08-01 09:56:10,524 [myid:] - INFO  [main:FourLetterWordMain@43] - connecting
to 127.0.0.1 11221
    [junit] 2012-08-01 09:56:10,524 [myid:] - INFO  [main:JMXEnv@133] - ensureOnly:[]
    [junit] 2012-08-01 09:56:10,527 [myid:] - INFO  [main:ClientBase@479] - fdcount after
test is: 41 at start it was 29
    [junit] 2012-08-01 09:56:10,527 [myid:] - INFO  [main:ClientBase@481] - sleeping for 20
secs
    [junit] 2012-08-01 09:56:10,529 [myid:] - INFO  [main:ZKTestCase$1@61] - SUCCEEDED testQuota
    [junit] 2012-08-01 09:56:10,529 [myid:] - INFO  [main:ZKTestCase$1@56] - FINISHED testQuota
    [junit] Tests run: 1, Failures: 0, Errors: 0, Time elapsed: 0.534 sec

BUILD FAILED
/home/jenkins/jenkins-slave/workspace/ZooKeeper-trunk-jdk7/trunk/build.xml:1302: The following
error occurred while executing this line:
/home/jenkins/jenkins-slave/workspace/ZooKeeper-trunk-jdk7/trunk/build.xml:1213: Tests failed!

Total time: 21 minutes 49 seconds
Build step 'Execute shell' marked build as failure
[WARNINGS] Skipping publisher since build result is FAILURE
Archiving artifacts
Recording test results
Publishing Javadoc
Email was triggered for: Failure
Sending email for trigger: Failure



###################################################################################
############################## FAILED TESTS (if any) ##############################
1 tests failed.
FAILED:  org.apache.zookeeper.server.quorum.Zab1_0Test.testUnnecessarySnap

Error Message:
null

Stack Trace:
java.lang.NullPointerException
	at org.apache.zookeeper.server.quorum.Zab1_0Test.recursiveDelete(Zab1_0Test.java:917)
	at org.apache.zookeeper.server.quorum.Zab1_0Test.recursiveDelete(Zab1_0Test.java:918)
	at org.apache.zookeeper.server.quorum.Zab1_0Test.recursiveDelete(Zab1_0Test.java:918)
	at org.apache.zookeeper.server.quorum.Zab1_0Test.testPopulatedLeaderConversation(Zab1_0Test.java:419)
	at org.apache.zookeeper.server.quorum.Zab1_0Test.testUnnecessarySnap(Zab1_0Test.java:483)



Mime
  • Unnamed multipart/mixed (inline, None, 0 bytes)
View raw message