zookeeper-dev mailing list archives

Site index · List index
Message view « Date » · « Thread »
Top « Date » · « Thread »
From Apache Jenkins Server <jenk...@builds.apache.org>
Subject ZooKeeper-trunk - Build # 1635 - Failure
Date Fri, 03 Aug 2012 10:55:21 GMT
See https://builds.apache.org/job/ZooKeeper-trunk/1635/

###################################################################################
########################## LAST 60 LINES OF THE CONSOLE ###########################
[...truncated 115049 lines...]
	at hudson.model.Build$BuildExecution.doRun(Build.java:160)
	at hudson.model.AbstractBuild$AbstractBuildExecution.run(AbstractBuild.java:499)
	at hudson.model.Run.execute(Run.java:1488)
	at hudson.model.FreeStyleBuild.run(FreeStyleBuild.java:46)
	at hudson.model.ResourceController.execute(ResourceController.java:88)
	at hudson.model.Executor.run(Executor.java:236)
Caused by: hudson.remoting.ChannelClosedException: channel is already closed
	at hudson.remoting.Channel.send(Channel.java:492)
	at hudson.remoting.Request.call(Request.java:129)
	at hudson.remoting.Channel.call(Channel.java:663)
	at hudson.FilePath.act(FilePath.java:831)
	... 13 more
Caused by: hudson.remoting.Channel$OrderlyShutdown
	at hudson.remoting.Channel$CloseCommand.execute(Channel.java:835)
	at hudson.remoting.Channel$2.handle(Channel.java:433)
	at hudson.remoting.SynchronousCommandTransport$ReaderThread.run(SynchronousCommandTransport.java:60)
Caused by: Command close created at
	at hudson.remoting.Command.<init>(Command.java:54)
	at hudson.remoting.Channel$CloseCommand.<init>(Channel.java:829)
	at hudson.remoting.Channel$CloseCommand.<init>(Channel.java:827)
	at hudson.remoting.Channel.close(Channel.java:894)
	at hudson.remoting.Channel.close(Channel.java:877)
	at hudson.remoting.Channel$CloseCommand.execute(Channel.java:834)
	... 2 more
FATAL: hudson.remoting.RequestAbortedException: hudson.remoting.Channel$OrderlyShutdown
hudson.remoting.RequestAbortedException: hudson.remoting.RequestAbortedException: hudson.remoting.Channel$OrderlyShutdown
	at hudson.remoting.Request.call(Request.java:174)
	at hudson.remoting.Channel.call(Channel.java:663)
	at hudson.remoting.RemoteInvocationHandler.invoke(RemoteInvocationHandler.java:158)
	at $Proxy34.join(Unknown Source)
	at hudson.Launcher$RemoteLauncher$ProcImpl.join(Launcher.java:861)
	at hudson.Launcher$ProcStarter.join(Launcher.java:345)
	at hudson.tasks.CommandInterpreter.perform(CommandInterpreter.java:82)
	at hudson.tasks.CommandInterpreter.perform(CommandInterpreter.java:58)
	at hudson.tasks.BuildStepMonitor$1.perform(BuildStepMonitor.java:19)
	at hudson.model.AbstractBuild$AbstractBuildExecution.perform(AbstractBuild.java:717)
	at hudson.model.Build$BuildExecution.build(Build.java:199)
	at hudson.model.Build$BuildExecution.doRun(Build.java:160)
	at hudson.model.AbstractBuild$AbstractBuildExecution.run(AbstractBuild.java:499)
	at hudson.model.Run.execute(Run.java:1488)
	at hudson.model.FreeStyleBuild.run(FreeStyleBuild.java:46)
	at hudson.model.ResourceController.execute(ResourceController.java:88)
	at hudson.model.Executor.run(Executor.java:236)
Caused by: hudson.remoting.RequestAbortedException: hudson.remoting.Channel$OrderlyShutdown
	at hudson.remoting.Request.abort(Request.java:299)
	at hudson.remoting.Channel.terminate(Channel.java:719)
	at hudson.remoting.Channel$CloseCommand.execute(Channel.java:835)
	at hudson.remoting.Channel$2.handle(Channel.java:433)
	at hudson.remoting.SynchronousCommandTransport$ReaderThread.run(SynchronousCommandTransport.java:60)
Caused by: hudson.remoting.Channel$OrderlyShutdown
	... 3 more
Caused by: Command close created at
	at hudson.remoting.Command.<init>(Command.java:54)
	at hudson.remoting.Channel$CloseCommand.<init>(Channel.java:829)
	at hudson.remoting.Channel$CloseCommand.<init>(Channel.java:827)
	at hudson.remoting.Channel.close(Channel.java:894)
	at hudson.remoting.Channel.close(Channel.java:877)
	at hudson.remoting.Channel$CloseCommand.execute(Channel.java:834)
	... 2 more



###################################################################################
############################## FAILED TESTS (if any) ##############################
No tests ran.
Mime
  • Unnamed multipart/mixed (inline, None, 0 bytes)
View raw message