zookeeper-dev mailing list archives

Site index · List index
Message view « Date » · « Thread »
Top « Date » · « Thread »
From Apache Jenkins Server <jenk...@builds.apache.org>
Subject Failed: ZOOKEEPER-1426 PreCommit Build #1150
Date Wed, 01 Aug 2012 17:43:20 GMT
Jira: https://issues.apache.org/jira/browse/ZOOKEEPER-1426
Build: https://builds.apache.org/job/PreCommit-ZOOKEEPER-Build/1150/

###################################################################################
########################## LAST 60 LINES OF THE CONSOLE ###########################
[...truncated 300 lines...]
     [exec] The next patch would delete the file hadoop-tools/hadoop-distcp/src/site/xdoc/index.xml,
     [exec] which does not exist!  Assume -R? [n] 
     [exec] Apply anyway? [n] 
     [exec] Skipping patch.
     [exec] 1 out of 1 hunk ignored
     [exec] The next patch would delete the file hadoop-tools/hadoop-distcp/src/site/xdoc/usage.xml,
     [exec] which does not exist!  Assume -R? [n] 
     [exec] Apply anyway? [n] 
     [exec] Skipping patch.
     [exec] 1 out of 1 hunk ignored
     [exec] PATCH APPLICATION FAILED
     [exec] 
     [exec] 
     [exec] 
     [exec] 
     [exec] -1 overall.  Here are the results of testing the latest attachment 
     [exec]   http://issues.apache.org/jira/secure/attachment/12538805/MAPREDUCE-4282-2.patch
     [exec]   against trunk revision 1368072.
     [exec] 
     [exec]     +1 @author.  The patch does not contain any @author tags.
     [exec] 
     [exec]     +1 tests included.  The patch appears to include 19 new or modified tests.
     [exec] 
     [exec]     -1 patch.  The patch command could not apply the patch.
     [exec] 
     [exec] Console output: https://builds.apache.org/job/PreCommit-ZOOKEEPER-Build/1150//console
     [exec] 
     [exec] This message is automatically generated.
     [exec] 
     [exec] 
     [exec] ======================================================================
     [exec] ======================================================================
     [exec]     Adding comment to Jira.
     [exec] ======================================================================
     [exec] ======================================================================
     [exec] 
     [exec] 
     [exec] Comment added.
     [exec] zHv7SYb9gn logged out
     [exec] 
     [exec] 
     [exec] ======================================================================
     [exec] ======================================================================
     [exec]     Finished build.
     [exec] ======================================================================
     [exec] ======================================================================
     [exec] 
     [exec] 

BUILD FAILED
/home/jenkins/jenkins-slave/workspace/PreCommit-ZOOKEEPER-Build/trunk/build.xml:1568: exec
returned: 1

Total time: 42 seconds
Build step 'Execute shell' marked build as failure
Archiving artifacts
Recording test results
Description set: ZOOKEEPER-1426
Email was triggered for: Failure
Sending email for trigger: Failure



###################################################################################
############################## FAILED TESTS (if any) ##############################
No tests ran.
Mime
  • Unnamed multipart/mixed (inline, None, 0 bytes)
View raw message