zookeeper-dev mailing list archives

Site index · List index
Message view « Date » · « Thread »
Top « Date » · « Thread »
From Apache Jenkins Server <jenk...@builds.apache.org>
Subject ZooKeeper-trunk-jdk7 - Build # 317 - Failure
Date Mon, 09 Jul 2012 09:55:23 GMT
See https://builds.apache.org/job/ZooKeeper-trunk-jdk7/317/

###################################################################################
########################## LAST 60 LINES OF THE CONSOLE ###########################
[...truncated 244681 lines...]
    [junit] 2012-07-09 09:55:12,027 [myid:] - INFO  [main:ClientBase@418] - STOPPING server
    [junit] 2012-07-09 09:55:12,027 [myid:] - INFO  [NIOServerCxn.Factory:0.0.0.0/0.0.0.0:11221:NIOServerCnxnFactory@238]
- NIOServerCnxn factory exited run method
    [junit] 2012-07-09 09:55:12,027 [myid:] - INFO  [main:ZooKeeperServer@399] - shutting
down
    [junit] 2012-07-09 09:55:12,027 [myid:] - INFO  [main:SessionTrackerImpl@220] - Shutting
down
    [junit] 2012-07-09 09:55:12,027 [myid:] - INFO  [main:PrepRequestProcessor@733] - Shutting
down
    [junit] 2012-07-09 09:55:12,028 [myid:] - INFO  [main:SyncRequestProcessor@175] - Shutting
down
    [junit] 2012-07-09 09:55:12,028 [myid:] - INFO  [SyncThread:0:SyncRequestProcessor@155]
- SyncRequestProcessor exited!
    [junit] 2012-07-09 09:55:12,028 [myid:] - INFO  [main:FinalRequestProcessor@411] - shutdown
of request processor complete
    [junit] 2012-07-09 09:55:12,028 [myid:] - INFO  [main:FourLetterWordMain@43] - connecting
to 127.0.0.1 11221
    [junit] 2012-07-09 09:55:12,029 [myid:] - INFO  [ProcessThread(sid:0 cport:-1)::PrepRequestProcessor@142]
- PrepRequestProcessor exited loop!
    [junit] 2012-07-09 09:55:12,029 [myid:] - INFO  [main:JMXEnv@133] - ensureOnly:[]
    [junit] 2012-07-09 09:55:12,030 [myid:] - INFO  [main:ClientBase@411] - STARTING server
    [junit] 2012-07-09 09:55:12,030 [myid:] - INFO  [main:ZooKeeperServer@147] - Created server
with tickTime 3000 minSessionTimeout 6000 maxSessionTimeout 60000 datadir /home/jenkins/jenkins-slave/workspace/ZooKeeper-trunk-jdk7/trunk/build/test/tmp/test6754371123516550181.junit.dir/version-2
snapdir /home/jenkins/jenkins-slave/workspace/ZooKeeper-trunk-jdk7/trunk/build/test/tmp/test6754371123516550181.junit.dir/version-2
    [junit] 2012-07-09 09:55:12,031 [myid:] - INFO  [main:NIOServerCnxnFactory@108] - binding
to port 0.0.0.0/0.0.0.0:11221
    [junit] 2012-07-09 09:55:12,031 [myid:] - INFO  [main:FileSnap@83] - Reading snapshot
/home/jenkins/jenkins-slave/workspace/ZooKeeper-trunk-jdk7/trunk/build/test/tmp/test6754371123516550181.junit.dir/version-2/snapshot.b
    [junit] 2012-07-09 09:55:12,033 [myid:] - INFO  [main:FileTxnSnapLog@268] - Snapshotting:
0xb to /home/jenkins/jenkins-slave/workspace/ZooKeeper-trunk-jdk7/trunk/build/test/tmp/test6754371123516550181.junit.dir/version-2/snapshot.b
    [junit] 2012-07-09 09:55:12,035 [myid:] - INFO  [main:FourLetterWordMain@43] - connecting
to 127.0.0.1 11221
    [junit] 2012-07-09 09:55:12,035 [myid:] - INFO  [NIOServerCxn.Factory:0.0.0.0/0.0.0.0:11221:NIOServerCnxnFactory@211]
- Accepted socket connection from /127.0.0.1:40432
    [junit] 2012-07-09 09:55:12,036 [myid:] - INFO  [NIOServerCxn.Factory:0.0.0.0/0.0.0.0:11221:NIOServerCnxn@821]
- Processing stat command from /127.0.0.1:40432
    [junit] 2012-07-09 09:55:12,036 [myid:] - INFO  [Thread-4:NIOServerCnxn$StatCommand@655]
- Stat command output
    [junit] 2012-07-09 09:55:12,037 [myid:] - INFO  [Thread-4:NIOServerCnxn@1001] - Closed
socket connection for client /127.0.0.1:40432 (no session established for client)
    [junit] 2012-07-09 09:55:12,037 [myid:] - INFO  [main:JMXEnv@133] - ensureOnly:[InMemoryDataTree,
StandaloneServer_port]
    [junit] 2012-07-09 09:55:12,038 [myid:] - INFO  [main:JMXEnv@105] - expect:InMemoryDataTree
    [junit] 2012-07-09 09:55:12,038 [myid:] - INFO  [main:JMXEnv@108] - found:InMemoryDataTree
org.apache.ZooKeeperService:name0=StandaloneServer_port-1,name1=InMemoryDataTree
    [junit] 2012-07-09 09:55:12,039 [myid:] - INFO  [main:JMXEnv@105] - expect:StandaloneServer_port
    [junit] 2012-07-09 09:55:12,039 [myid:] - INFO  [main:JMXEnv@108] - found:StandaloneServer_port
org.apache.ZooKeeperService:name0=StandaloneServer_port-1
    [junit] 2012-07-09 09:55:12,039 [myid:] - INFO  [main:JUnit4ZKTestRunner$LoggedInvokeMethod@57]
- FINISHED TEST METHOD testQuota
    [junit] 2012-07-09 09:55:12,039 [myid:] - INFO  [main:ClientBase@448] - tearDown starting
    [junit] 2012-07-09 09:55:12,113 [myid:] - INFO  [main:ZooKeeper@679] - Session: 0x1386b2a03630000
closed
    [junit] 2012-07-09 09:55:12,113 [myid:] - INFO  [main-EventThread:ClientCnxn$EventThread@511]
- EventThread shut down
    [junit] 2012-07-09 09:55:12,113 [myid:] - INFO  [main:ClientBase@418] - STOPPING server
    [junit] 2012-07-09 09:55:12,114 [myid:] - INFO  [NIOServerCxn.Factory:0.0.0.0/0.0.0.0:11221:NIOServerCnxnFactory@238]
- NIOServerCnxn factory exited run method
    [junit] 2012-07-09 09:55:12,114 [myid:] - INFO  [main:ZooKeeperServer@399] - shutting
down
    [junit] 2012-07-09 09:55:12,114 [myid:] - INFO  [main:SessionTrackerImpl@220] - Shutting
down
    [junit] 2012-07-09 09:55:12,114 [myid:] - INFO  [main:PrepRequestProcessor@733] - Shutting
down
    [junit] 2012-07-09 09:55:12,115 [myid:] - INFO  [main:SyncRequestProcessor@175] - Shutting
down
    [junit] 2012-07-09 09:55:12,115 [myid:] - INFO  [ProcessThread(sid:0 cport:-1)::PrepRequestProcessor@142]
- PrepRequestProcessor exited loop!
    [junit] 2012-07-09 09:55:12,115 [myid:] - INFO  [SyncThread:0:SyncRequestProcessor@155]
- SyncRequestProcessor exited!
    [junit] 2012-07-09 09:55:12,115 [myid:] - INFO  [main:FinalRequestProcessor@411] - shutdown
of request processor complete
    [junit] 2012-07-09 09:55:12,115 [myid:] - INFO  [main:FourLetterWordMain@43] - connecting
to 127.0.0.1 11221
    [junit] 2012-07-09 09:55:12,116 [myid:] - INFO  [main:JMXEnv@133] - ensureOnly:[]
    [junit] 2012-07-09 09:55:12,119 [myid:] - INFO  [main:ClientBase@476] - fdcount after
test is: 41 at start it was 29
    [junit] 2012-07-09 09:55:12,119 [myid:] - INFO  [main:ClientBase@478] - sleeping for 20
secs
    [junit] 2012-07-09 09:55:12,121 [myid:] - INFO  [main:ZKTestCase$1@61] - SUCCEEDED testQuota
    [junit] 2012-07-09 09:55:12,121 [myid:] - INFO  [main:ZKTestCase$1@56] - FINISHED testQuota
    [junit] Tests run: 1, Failures: 0, Errors: 0, Time elapsed: 0.547 sec

BUILD FAILED
/home/jenkins/jenkins-slave/workspace/ZooKeeper-trunk-jdk7/trunk/build.xml:1302: The following
error occurred while executing this line:
/home/jenkins/jenkins-slave/workspace/ZooKeeper-trunk-jdk7/trunk/build.xml:1213: Tests failed!

Total time: 21 minutes 49 seconds
Build step 'Execute shell' marked build as failure
[WARNINGS] Skipping publisher since build result is FAILURE
Archiving artifacts
Recording test results
Publishing Javadoc
Email was triggered for: Failure
Sending email for trigger: Failure



###################################################################################
############################## FAILED TESTS (if any) ##############################
1 tests failed.
REGRESSION:  org.apache.zookeeper.test.WatcherTest.testWatchAutoResetWithPending

Error Message:
Did not connect

Stack Trace:
java.util.concurrent.TimeoutException: Did not connect
	at org.apache.zookeeper.test.ClientBase$CountdownWatcher.waitForConnected(ClientBase.java:126)
	at org.apache.zookeeper.test.WatcherTest.testWatchAutoResetWithPending(WatcherTest.java:199)
	at org.apache.zookeeper.JUnit4ZKTestRunner$LoggedInvokeMethod.evaluate(JUnit4ZKTestRunner.java:52)



Mime
  • Unnamed multipart/mixed (inline, None, 0 bytes)
View raw message