zookeeper-dev mailing list archives

Site index · List index
Message view « Date » · « Thread »
Top « Date » · « Thread »
From Apache Jenkins Server <jenk...@builds.apache.org>
Subject ZooKeeper-trunk-jdk7 - Build # 332 - Failure
Date Tue, 24 Jul 2012 09:54:54 GMT
See https://builds.apache.org/job/ZooKeeper-trunk-jdk7/332/

###################################################################################
########################## LAST 60 LINES OF THE CONSOLE ###########################
[...truncated 256811 lines...]
    [junit] 2012-07-24 09:54:42,290 [myid:] - INFO  [main:ClientBase@421] - STOPPING server
    [junit] 2012-07-24 09:54:42,290 [myid:] - INFO  [NIOServerCxn.Factory:0.0.0.0/0.0.0.0:11221:NIOServerCnxnFactory@238]
- NIOServerCnxn factory exited run method
    [junit] 2012-07-24 09:54:42,290 [myid:] - INFO  [main:ZooKeeperServer@399] - shutting
down
    [junit] 2012-07-24 09:54:42,291 [myid:] - INFO  [main:SessionTrackerImpl@220] - Shutting
down
    [junit] 2012-07-24 09:54:42,291 [myid:] - INFO  [main:PrepRequestProcessor@733] - Shutting
down
    [junit] 2012-07-24 09:54:42,291 [myid:] - INFO  [main:SyncRequestProcessor@175] - Shutting
down
    [junit] 2012-07-24 09:54:42,291 [myid:] - INFO  [SyncThread:0:SyncRequestProcessor@155]
- SyncRequestProcessor exited!
    [junit] 2012-07-24 09:54:42,291 [myid:] - INFO  [main:FinalRequestProcessor@411] - shutdown
of request processor complete
    [junit] 2012-07-24 09:54:42,292 [myid:] - INFO  [ProcessThread(sid:0 cport:-1)::PrepRequestProcessor@142]
- PrepRequestProcessor exited loop!
    [junit] 2012-07-24 09:54:42,292 [myid:] - INFO  [main:FourLetterWordMain@43] - connecting
to 127.0.0.1 11221
    [junit] 2012-07-24 09:54:42,292 [myid:] - INFO  [main:JMXEnv@133] - ensureOnly:[]
    [junit] 2012-07-24 09:54:42,293 [myid:] - INFO  [main:ClientBase@414] - STARTING server
    [junit] 2012-07-24 09:54:42,294 [myid:] - INFO  [main:ZooKeeperServer@147] - Created server
with tickTime 3000 minSessionTimeout 6000 maxSessionTimeout 60000 datadir /home/jenkins/jenkins-slave/workspace/ZooKeeper-trunk-jdk7/trunk/build/test/tmp/test5354679655810252712.junit.dir/version-2
snapdir /home/jenkins/jenkins-slave/workspace/ZooKeeper-trunk-jdk7/trunk/build/test/tmp/test5354679655810252712.junit.dir/version-2
    [junit] 2012-07-24 09:54:42,294 [myid:] - INFO  [main:NIOServerCnxnFactory@108] - binding
to port 0.0.0.0/0.0.0.0:11221
    [junit] 2012-07-24 09:54:42,295 [myid:] - INFO  [main:FileSnap@83] - Reading snapshot
/home/jenkins/jenkins-slave/workspace/ZooKeeper-trunk-jdk7/trunk/build/test/tmp/test5354679655810252712.junit.dir/version-2/snapshot.b
    [junit] 2012-07-24 09:54:42,297 [myid:] - INFO  [main:FileTxnSnapLog@270] - Snapshotting:
0xb to /home/jenkins/jenkins-slave/workspace/ZooKeeper-trunk-jdk7/trunk/build/test/tmp/test5354679655810252712.junit.dir/version-2/snapshot.b
    [junit] 2012-07-24 09:54:42,298 [myid:] - INFO  [main:FourLetterWordMain@43] - connecting
to 127.0.0.1 11221
    [junit] 2012-07-24 09:54:42,299 [myid:] - INFO  [NIOServerCxn.Factory:0.0.0.0/0.0.0.0:11221:NIOServerCnxnFactory@211]
- Accepted socket connection from /127.0.0.1:42675
    [junit] 2012-07-24 09:54:42,299 [myid:] - INFO  [NIOServerCxn.Factory:0.0.0.0/0.0.0.0:11221:NIOServerCnxn@821]
- Processing stat command from /127.0.0.1:42675
    [junit] 2012-07-24 09:54:42,299 [myid:] - INFO  [Thread-4:NIOServerCnxn$StatCommand@655]
- Stat command output
    [junit] 2012-07-24 09:54:42,300 [myid:] - INFO  [Thread-4:NIOServerCnxn@1001] - Closed
socket connection for client /127.0.0.1:42675 (no session established for client)
    [junit] 2012-07-24 09:54:42,300 [myid:] - INFO  [main:JMXEnv@133] - ensureOnly:[InMemoryDataTree,
StandaloneServer_port]
    [junit] 2012-07-24 09:54:42,301 [myid:] - INFO  [main:JMXEnv@105] - expect:InMemoryDataTree
    [junit] 2012-07-24 09:54:42,302 [myid:] - INFO  [main:JMXEnv@108] - found:InMemoryDataTree
org.apache.ZooKeeperService:name0=StandaloneServer_port-1,name1=InMemoryDataTree
    [junit] 2012-07-24 09:54:42,302 [myid:] - INFO  [main:JMXEnv@105] - expect:StandaloneServer_port
    [junit] 2012-07-24 09:54:42,302 [myid:] - INFO  [main:JMXEnv@108] - found:StandaloneServer_port
org.apache.ZooKeeperService:name0=StandaloneServer_port-1
    [junit] 2012-07-24 09:54:42,302 [myid:] - INFO  [main:JUnit4ZKTestRunner$LoggedInvokeMethod@57]
- FINISHED TEST METHOD testQuota
    [junit] 2012-07-24 09:54:42,302 [myid:] - INFO  [main:ClientBase@451] - tearDown starting
    [junit] 2012-07-24 09:54:42,376 [myid:] - INFO  [main:ZooKeeper@679] - Session: 0x138b868f2e70000
closed
    [junit] 2012-07-24 09:54:42,377 [myid:] - INFO  [main:ClientBase@421] - STOPPING server
    [junit] 2012-07-24 09:54:42,377 [myid:] - INFO  [main-EventThread:ClientCnxn$EventThread@511]
- EventThread shut down
    [junit] 2012-07-24 09:54:42,377 [myid:] - INFO  [NIOServerCxn.Factory:0.0.0.0/0.0.0.0:11221:NIOServerCnxnFactory@238]
- NIOServerCnxn factory exited run method
    [junit] 2012-07-24 09:54:42,377 [myid:] - INFO  [main:ZooKeeperServer@399] - shutting
down
    [junit] 2012-07-24 09:54:42,378 [myid:] - INFO  [main:SessionTrackerImpl@220] - Shutting
down
    [junit] 2012-07-24 09:54:42,378 [myid:] - INFO  [main:PrepRequestProcessor@733] - Shutting
down
    [junit] 2012-07-24 09:54:42,378 [myid:] - INFO  [main:SyncRequestProcessor@175] - Shutting
down
    [junit] 2012-07-24 09:54:42,378 [myid:] - INFO  [SyncThread:0:SyncRequestProcessor@155]
- SyncRequestProcessor exited!
    [junit] 2012-07-24 09:54:42,378 [myid:] - INFO  [main:FinalRequestProcessor@411] - shutdown
of request processor complete
    [junit] 2012-07-24 09:54:42,378 [myid:] - INFO  [ProcessThread(sid:0 cport:-1)::PrepRequestProcessor@142]
- PrepRequestProcessor exited loop!
    [junit] 2012-07-24 09:54:42,379 [myid:] - INFO  [main:FourLetterWordMain@43] - connecting
to 127.0.0.1 11221
    [junit] 2012-07-24 09:54:42,379 [myid:] - INFO  [main:JMXEnv@133] - ensureOnly:[]
    [junit] 2012-07-24 09:54:42,382 [myid:] - INFO  [main:ClientBase@479] - fdcount after
test is: 41 at start it was 29
    [junit] 2012-07-24 09:54:42,383 [myid:] - INFO  [main:ClientBase@481] - sleeping for 20
secs
    [junit] 2012-07-24 09:54:42,384 [myid:] - INFO  [main:ZKTestCase$1@61] - SUCCEEDED testQuota
    [junit] 2012-07-24 09:54:42,384 [myid:] - INFO  [main:ZKTestCase$1@56] - FINISHED testQuota
    [junit] Tests run: 1, Failures: 0, Errors: 0, Time elapsed: 0.624 sec

BUILD FAILED
/home/jenkins/jenkins-slave/workspace/ZooKeeper-trunk-jdk7/trunk/build.xml:1302: The following
error occurred while executing this line:
/home/jenkins/jenkins-slave/workspace/ZooKeeper-trunk-jdk7/trunk/build.xml:1213: Tests failed!

Total time: 21 minutes 35 seconds
Build step 'Execute shell' marked build as failure
[WARNINGS] Skipping publisher since build result is FAILURE
Archiving artifacts
Recording test results
Publishing Javadoc
Email was triggered for: Failure
Sending email for trigger: Failure



###################################################################################
############################## FAILED TESTS (if any) ##############################
1 tests failed.
REGRESSION:  org.apache.zookeeper.server.quorum.Zab1_0Test.testLeaderInElectingFollowers

Error Message:
Address already in use

Stack Trace:
java.net.BindException: Address already in use
	at java.net.PlainSocketImpl.socketBind(Native Method)
	at java.net.AbstractPlainSocketImpl.bind(AbstractPlainSocketImpl.java:374)
	at java.net.ServerSocket.bind(ServerSocket.java:376)
	at java.net.ServerSocket.bind(ServerSocket.java:330)
	at org.apache.zookeeper.server.quorum.Leader.<init>(Leader.java:184)
	at org.apache.zookeeper.server.quorum.Zab1_0Test.createLeader(Zab1_0Test.java:927)
	at org.apache.zookeeper.server.quorum.Zab1_0Test.testLeaderInElectingFollowers(Zab1_0Test.java:227)



Mime
  • Unnamed multipart/mixed (inline, None, 0 bytes)
View raw message