zookeeper-dev mailing list archives

Site index · List index
Message view « Date » · « Thread »
Top « Date » · « Thread »
From Apache Jenkins Server <jenk...@builds.apache.org>
Subject ZooKeeper-trunk - Build # 1621 - Failure
Date Sun, 22 Jul 2012 10:53:59 GMT
See https://builds.apache.org/job/ZooKeeper-trunk/1621/

###################################################################################
########################## LAST 60 LINES OF THE CONSOLE ###########################
[...truncated 267021 lines...]
    [junit] 2012-07-22 10:53:47,386 [myid:] - INFO  [main:ZooKeeperServer@399] - shutting
down
    [junit] 2012-07-22 10:53:47,386 [myid:] - INFO  [main:SessionTrackerImpl@220] - Shutting
down
    [junit] 2012-07-22 10:53:47,386 [myid:] - INFO  [main:PrepRequestProcessor@733] - Shutting
down
    [junit] 2012-07-22 10:53:47,387 [myid:] - INFO  [main:SyncRequestProcessor@175] - Shutting
down
    [junit] 2012-07-22 10:53:47,387 [myid:] - INFO  [ProcessThread(sid:0 cport:-1)::PrepRequestProcessor@142]
- PrepRequestProcessor exited loop!
    [junit] 2012-07-22 10:53:47,387 [myid:] - INFO  [SyncThread:0:SyncRequestProcessor@155]
- SyncRequestProcessor exited!
    [junit] 2012-07-22 10:53:47,387 [myid:] - INFO  [main:FinalRequestProcessor@411] - shutdown
of request processor complete
    [junit] 2012-07-22 10:53:47,388 [myid:] - INFO  [main:FourLetterWordMain@43] - connecting
to 127.0.0.1 11221
    [junit] 2012-07-22 10:53:47,388 [myid:] - INFO  [main:JMXEnv@133] - ensureOnly:[]
    [junit] 2012-07-22 10:53:47,389 [myid:] - INFO  [main:ClientBase@414] - STARTING server
    [junit] 2012-07-22 10:53:47,390 [myid:] - INFO  [main:ZooKeeperServer@147] - Created server
with tickTime 3000 minSessionTimeout 6000 maxSessionTimeout 60000 datadir /home/jenkins/jenkins-slave/workspace/ZooKeeper-trunk/trunk/build/test/tmp/test3499563366797297118.junit.dir/version-2
snapdir /home/jenkins/jenkins-slave/workspace/ZooKeeper-trunk/trunk/build/test/tmp/test3499563366797297118.junit.dir/version-2
    [junit] 2012-07-22 10:53:47,390 [myid:] - INFO  [main:NIOServerCnxnFactory@108] - binding
to port 0.0.0.0/0.0.0.0:11221
    [junit] 2012-07-22 10:53:47,391 [myid:] - INFO  [main:FileSnap@83] - Reading snapshot
/home/jenkins/jenkins-slave/workspace/ZooKeeper-trunk/trunk/build/test/tmp/test3499563366797297118.junit.dir/version-2/snapshot.b
    [junit] 2012-07-22 10:53:47,394 [myid:] - INFO  [main:FileTxnSnapLog@270] - Snapshotting:
0xb to /home/jenkins/jenkins-slave/workspace/ZooKeeper-trunk/trunk/build/test/tmp/test3499563366797297118.junit.dir/version-2/snapshot.b
    [junit] 2012-07-22 10:53:47,395 [myid:] - INFO  [main:FourLetterWordMain@43] - connecting
to 127.0.0.1 11221
    [junit] 2012-07-22 10:53:47,396 [myid:] - INFO  [NIOServerCxn.Factory:0.0.0.0/0.0.0.0:11221:NIOServerCnxnFactory@211]
- Accepted socket connection from /127.0.0.1:51475
    [junit] 2012-07-22 10:53:47,396 [myid:] - INFO  [NIOServerCxn.Factory:0.0.0.0/0.0.0.0:11221:NIOServerCnxn@821]
- Processing stat command from /127.0.0.1:51475
    [junit] 2012-07-22 10:53:47,396 [myid:] - INFO  [Thread-5:NIOServerCnxn$StatCommand@655]
- Stat command output
    [junit] 2012-07-22 10:53:47,397 [myid:] - INFO  [Thread-5:NIOServerCnxn@1001] - Closed
socket connection for client /127.0.0.1:51475 (no session established for client)
    [junit] 2012-07-22 10:53:47,397 [myid:] - INFO  [main:JMXEnv@133] - ensureOnly:[InMemoryDataTree,
StandaloneServer_port]
    [junit] 2012-07-22 10:53:47,398 [myid:] - INFO  [main:JMXEnv@105] - expect:InMemoryDataTree
    [junit] 2012-07-22 10:53:47,399 [myid:] - INFO  [main:JMXEnv@108] - found:InMemoryDataTree
org.apache.ZooKeeperService:name0=StandaloneServer_port-1,name1=InMemoryDataTree
    [junit] 2012-07-22 10:53:47,399 [myid:] - INFO  [main:JMXEnv@105] - expect:StandaloneServer_port
    [junit] 2012-07-22 10:53:47,399 [myid:] - INFO  [main:JMXEnv@108] - found:StandaloneServer_port
org.apache.ZooKeeperService:name0=StandaloneServer_port-1
    [junit] 2012-07-22 10:53:47,399 [myid:] - INFO  [main:JUnit4ZKTestRunner$LoggedInvokeMethod@57]
- FINISHED TEST METHOD testQuota
    [junit] 2012-07-22 10:53:47,399 [myid:] - INFO  [main:ClientBase@451] - tearDown starting
    [junit] 2012-07-22 10:53:47,471 [myid:] - INFO  [main:ZooKeeper@679] - Session: 0x138ae52531f0000
closed
    [junit] 2012-07-22 10:53:47,471 [myid:] - INFO  [main-EventThread:ClientCnxn$EventThread@511]
- EventThread shut down
    [junit] 2012-07-22 10:53:47,471 [myid:] - INFO  [main:ClientBase@421] - STOPPING server
    [junit] 2012-07-22 10:53:47,472 [myid:] - INFO  [NIOServerCxn.Factory:0.0.0.0/0.0.0.0:11221:NIOServerCnxnFactory@238]
- NIOServerCnxn factory exited run method
    [junit] 2012-07-22 10:53:47,472 [myid:] - INFO  [main:ZooKeeperServer@399] - shutting
down
    [junit] 2012-07-22 10:53:47,472 [myid:] - INFO  [main:SessionTrackerImpl@220] - Shutting
down
    [junit] 2012-07-22 10:53:47,472 [myid:] - INFO  [main:PrepRequestProcessor@733] - Shutting
down
    [junit] 2012-07-22 10:53:47,473 [myid:] - INFO  [main:SyncRequestProcessor@175] - Shutting
down
    [junit] 2012-07-22 10:53:47,473 [myid:] - INFO  [ProcessThread(sid:0 cport:-1)::PrepRequestProcessor@142]
- PrepRequestProcessor exited loop!
    [junit] 2012-07-22 10:53:47,473 [myid:] - INFO  [SyncThread:0:SyncRequestProcessor@155]
- SyncRequestProcessor exited!
    [junit] 2012-07-22 10:53:47,473 [myid:] - INFO  [main:FinalRequestProcessor@411] - shutdown
of request processor complete
    [junit] 2012-07-22 10:53:47,474 [myid:] - INFO  [main:FourLetterWordMain@43] - connecting
to 127.0.0.1 11221
    [junit] 2012-07-22 10:53:47,474 [myid:] - INFO  [main:JMXEnv@133] - ensureOnly:[]
    [junit] 2012-07-22 10:53:47,477 [myid:] - INFO  [main:ClientBase@479] - fdcount after
test is: 41 at start it was 28
    [junit] 2012-07-22 10:53:47,477 [myid:] - INFO  [main:ClientBase@481] - sleeping for 20
secs
    [junit] 2012-07-22 10:53:47,478 [myid:] - INFO  [main:ZKTestCase$1@61] - SUCCEEDED testQuota
    [junit] 2012-07-22 10:53:47,479 [myid:] - INFO  [main:ZKTestCase$1@56] - FINISHED testQuota
    [junit] Tests run: 1, Failures: 0, Errors: 0, Time elapsed: 0.607 sec

BUILD FAILED
/home/jenkins/jenkins-slave/workspace/ZooKeeper-trunk/trunk/build.xml:1302: The following
error occurred while executing this line:
/home/jenkins/jenkins-slave/workspace/ZooKeeper-trunk/trunk/build.xml:1213: Tests failed!

Total time: 21 minutes 14 seconds
Build step 'Execute shell' marked build as failure
[FINDBUGS] Skipping publisher since build result is FAILURE
[WARNINGS] Skipping publisher since build result is FAILURE
Archiving artifacts
Recording fingerprints
Recording test results
Publishing Javadoc
Email was triggered for: Failure
Sending email for trigger: Failure



###################################################################################
############################## FAILED TESTS (if any) ##############################
1 tests failed.
REGRESSION:  org.apache.zookeeper.server.quorum.QuorumPeerMainTest.testInconsistentPeerType

Error Message:
Should warn about inconsistent peer type

Stack Trace:
junit.framework.AssertionFailedError: Should warn about inconsistent peer type
	at org.apache.zookeeper.server.quorum.QuorumPeerMainTest.testInconsistentPeerType(QuorumPeerMainTest.java:516)
	at org.apache.zookeeper.JUnit4ZKTestRunner$LoggedInvokeMethod.evaluate(JUnit4ZKTestRunner.java:52)



Mime
  • Unnamed multipart/mixed (inline, None, 0 bytes)
View raw message