zookeeper-dev mailing list archives

Site index · List index
Message view « Date » · « Thread »
Top « Date » · « Thread »
From Apache Jenkins Server <jenk...@builds.apache.org>
Subject ZooKeeper-trunk-jdk7 - Build # 323 - Failure
Date Sun, 15 Jul 2012 09:54:11 GMT
See https://builds.apache.org/job/ZooKeeper-trunk-jdk7/323/

###################################################################################
########################## LAST 60 LINES OF THE CONSOLE ###########################
[...truncated 279472 lines...]
    [junit] 2012-07-15 09:53:58,760 [myid:] - INFO  [main:ClientBase@418] - STOPPING server
    [junit] 2012-07-15 09:53:58,760 [myid:] - INFO  [NIOServerCxn.Factory:0.0.0.0/0.0.0.0:11221:NIOServerCnxnFactory@238]
- NIOServerCnxn factory exited run method
    [junit] 2012-07-15 09:53:58,760 [myid:] - INFO  [main:ZooKeeperServer@399] - shutting
down
    [junit] 2012-07-15 09:53:58,760 [myid:] - INFO  [main:SessionTrackerImpl@220] - Shutting
down
    [junit] 2012-07-15 09:53:58,760 [myid:] - INFO  [main:PrepRequestProcessor@733] - Shutting
down
    [junit] 2012-07-15 09:53:58,760 [myid:] - INFO  [main:SyncRequestProcessor@175] - Shutting
down
    [junit] 2012-07-15 09:53:58,761 [myid:] - INFO  [ProcessThread(sid:0 cport:-1)::PrepRequestProcessor@142]
- PrepRequestProcessor exited loop!
    [junit] 2012-07-15 09:53:58,761 [myid:] - INFO  [SyncThread:0:SyncRequestProcessor@155]
- SyncRequestProcessor exited!
    [junit] 2012-07-15 09:53:58,761 [myid:] - INFO  [main:FinalRequestProcessor@411] - shutdown
of request processor complete
    [junit] 2012-07-15 09:53:58,761 [myid:] - INFO  [main:FourLetterWordMain@43] - connecting
to 127.0.0.1 11221
    [junit] 2012-07-15 09:53:58,762 [myid:] - INFO  [main:JMXEnv@133] - ensureOnly:[]
    [junit] 2012-07-15 09:53:58,763 [myid:] - INFO  [main:ClientBase@411] - STARTING server
    [junit] 2012-07-15 09:53:58,763 [myid:] - INFO  [main:ZooKeeperServer@147] - Created server
with tickTime 3000 minSessionTimeout 6000 maxSessionTimeout 60000 datadir /home/jenkins/jenkins-slave/workspace/ZooKeeper-trunk-jdk7/trunk/build/test/tmp/test5449055342767770451.junit.dir/version-2
snapdir /home/jenkins/jenkins-slave/workspace/ZooKeeper-trunk-jdk7/trunk/build/test/tmp/test5449055342767770451.junit.dir/version-2
    [junit] 2012-07-15 09:53:58,763 [myid:] - INFO  [main:NIOServerCnxnFactory@108] - binding
to port 0.0.0.0/0.0.0.0:11221
    [junit] 2012-07-15 09:53:58,764 [myid:] - INFO  [main:FileSnap@83] - Reading snapshot
/home/jenkins/jenkins-slave/workspace/ZooKeeper-trunk-jdk7/trunk/build/test/tmp/test5449055342767770451.junit.dir/version-2/snapshot.b
    [junit] 2012-07-15 09:53:58,765 [myid:] - INFO  [main:FileTxnSnapLog@268] - Snapshotting:
0xb to /home/jenkins/jenkins-slave/workspace/ZooKeeper-trunk-jdk7/trunk/build/test/tmp/test5449055342767770451.junit.dir/version-2/snapshot.b
    [junit] 2012-07-15 09:53:58,767 [myid:] - INFO  [main:FourLetterWordMain@43] - connecting
to 127.0.0.1 11221
    [junit] 2012-07-15 09:53:58,767 [myid:] - INFO  [NIOServerCxn.Factory:0.0.0.0/0.0.0.0:11221:NIOServerCnxnFactory@211]
- Accepted socket connection from /127.0.0.1:51286
    [junit] 2012-07-15 09:53:58,767 [myid:] - INFO  [NIOServerCxn.Factory:0.0.0.0/0.0.0.0:11221:NIOServerCnxn@821]
- Processing stat command from /127.0.0.1:51286
    [junit] 2012-07-15 09:53:58,768 [myid:] - INFO  [Thread-4:NIOServerCnxn$StatCommand@655]
- Stat command output
    [junit] 2012-07-15 09:53:58,768 [myid:] - INFO  [Thread-4:NIOServerCnxn@1001] - Closed
socket connection for client /127.0.0.1:51286 (no session established for client)
    [junit] 2012-07-15 09:53:58,768 [myid:] - INFO  [main:JMXEnv@133] - ensureOnly:[InMemoryDataTree,
StandaloneServer_port]
    [junit] 2012-07-15 09:53:58,769 [myid:] - INFO  [main:JMXEnv@105] - expect:InMemoryDataTree
    [junit] 2012-07-15 09:53:58,769 [myid:] - INFO  [main:JMXEnv@108] - found:InMemoryDataTree
org.apache.ZooKeeperService:name0=StandaloneServer_port-1,name1=InMemoryDataTree
    [junit] 2012-07-15 09:53:58,770 [myid:] - INFO  [main:JMXEnv@105] - expect:StandaloneServer_port
    [junit] 2012-07-15 09:53:58,770 [myid:] - INFO  [main:JMXEnv@108] - found:StandaloneServer_port
org.apache.ZooKeeperService:name0=StandaloneServer_port-1
    [junit] 2012-07-15 09:53:58,770 [myid:] - INFO  [main:JUnit4ZKTestRunner$LoggedInvokeMethod@57]
- FINISHED TEST METHOD testQuota
    [junit] 2012-07-15 09:53:58,770 [myid:] - INFO  [main:ClientBase@448] - tearDown starting
    [junit] 2012-07-15 09:53:58,848 [myid:] - INFO  [main:ZooKeeper@679] - Session: 0x1388a0f0d2e0000
closed
    [junit] 2012-07-15 09:53:58,848 [myid:] - INFO  [main:ClientBase@418] - STOPPING server
    [junit] 2012-07-15 09:53:58,848 [myid:] - INFO  [main-EventThread:ClientCnxn$EventThread@511]
- EventThread shut down
    [junit] 2012-07-15 09:53:58,848 [myid:] - INFO  [NIOServerCxn.Factory:0.0.0.0/0.0.0.0:11221:NIOServerCnxnFactory@238]
- NIOServerCnxn factory exited run method
    [junit] 2012-07-15 09:53:58,848 [myid:] - INFO  [main:ZooKeeperServer@399] - shutting
down
    [junit] 2012-07-15 09:53:58,849 [myid:] - INFO  [main:SessionTrackerImpl@220] - Shutting
down
    [junit] 2012-07-15 09:53:58,849 [myid:] - INFO  [main:PrepRequestProcessor@733] - Shutting
down
    [junit] 2012-07-15 09:53:58,849 [myid:] - INFO  [main:SyncRequestProcessor@175] - Shutting
down
    [junit] 2012-07-15 09:53:58,849 [myid:] - INFO  [ProcessThread(sid:0 cport:-1)::PrepRequestProcessor@142]
- PrepRequestProcessor exited loop!
    [junit] 2012-07-15 09:53:58,849 [myid:] - INFO  [SyncThread:0:SyncRequestProcessor@155]
- SyncRequestProcessor exited!
    [junit] 2012-07-15 09:53:58,850 [myid:] - INFO  [main:FinalRequestProcessor@411] - shutdown
of request processor complete
    [junit] 2012-07-15 09:53:58,850 [myid:] - INFO  [main:FourLetterWordMain@43] - connecting
to 127.0.0.1 11221
    [junit] 2012-07-15 09:53:58,850 [myid:] - INFO  [main:JMXEnv@133] - ensureOnly:[]
    [junit] 2012-07-15 09:53:58,853 [myid:] - INFO  [main:ClientBase@476] - fdcount after
test is: 41 at start it was 29
    [junit] 2012-07-15 09:53:58,854 [myid:] - INFO  [main:ClientBase@478] - sleeping for 20
secs
    [junit] 2012-07-15 09:53:58,855 [myid:] - INFO  [main:ZKTestCase$1@61] - SUCCEEDED testQuota
    [junit] 2012-07-15 09:53:58,855 [myid:] - INFO  [main:ZKTestCase$1@56] - FINISHED testQuota
    [junit] Tests run: 1, Failures: 0, Errors: 0, Time elapsed: 0.53 sec

BUILD FAILED
/home/jenkins/jenkins-slave/workspace/ZooKeeper-trunk-jdk7/trunk/build.xml:1302: The following
error occurred while executing this line:
/home/jenkins/jenkins-slave/workspace/ZooKeeper-trunk-jdk7/trunk/build.xml:1213: Tests failed!

Total time: 21 minutes 13 seconds
Build step 'Execute shell' marked build as failure
[WARNINGS] Skipping publisher since build result is FAILURE
Archiving artifacts
Recording test results
Publishing Javadoc
Email was triggered for: Failure
Sending email for trigger: Failure



###################################################################################
############################## FAILED TESTS (if any) ##############################
1 tests failed.
REGRESSION:  org.apache.zookeeper.test.LETest.testLE

Error Message:
Threads didn't join

Stack Trace:
junit.framework.AssertionFailedError: Threads didn't join
	at org.apache.zookeeper.test.LETest.testLE(LETest.java:123)
	at org.apache.zookeeper.JUnit4ZKTestRunner$LoggedInvokeMethod.evaluate(JUnit4ZKTestRunner.java:52)



Mime
  • Unnamed multipart/mixed (inline, None, 0 bytes)
View raw message