zookeeper-dev mailing list archives

Site index · List index
Message view « Date » · « Thread »
Top « Date » · « Thread »
From Apache Jenkins Server <jenk...@builds.apache.org>
Subject ZooKeeper-trunk-jdk7 - Build # 328 - Failure
Date Fri, 20 Jul 2012 09:55:50 GMT
See https://builds.apache.org/job/ZooKeeper-trunk-jdk7/328/

###################################################################################
########################## LAST 60 LINES OF THE CONSOLE ###########################
[...truncated 198786 lines...]
    [junit] 2012-07-20 09:55:30,873 [myid:] - INFO  [main:ClientBase@421] - STOPPING server
    [junit] 2012-07-20 09:55:30,873 [myid:] - INFO  [NIOServerCxn.Factory:0.0.0.0/0.0.0.0:11221:NIOServerCnxnFactory@238]
- NIOServerCnxn factory exited run method
    [junit] 2012-07-20 09:55:30,873 [myid:] - INFO  [main:ZooKeeperServer@399] - shutting
down
    [junit] 2012-07-20 09:55:30,873 [myid:] - INFO  [main:SessionTrackerImpl@220] - Shutting
down
    [junit] 2012-07-20 09:55:30,874 [myid:] - INFO  [main:PrepRequestProcessor@733] - Shutting
down
    [junit] 2012-07-20 09:55:30,874 [myid:] - INFO  [main:SyncRequestProcessor@175] - Shutting
down
    [junit] 2012-07-20 09:55:30,874 [myid:] - INFO  [SyncThread:0:SyncRequestProcessor@155]
- SyncRequestProcessor exited!
    [junit] 2012-07-20 09:55:30,874 [myid:] - INFO  [main:FinalRequestProcessor@411] - shutdown
of request processor complete
    [junit] 2012-07-20 09:55:30,875 [myid:] - INFO  [main:FourLetterWordMain@43] - connecting
to 127.0.0.1 11221
    [junit] 2012-07-20 09:55:30,875 [myid:] - INFO  [main:JMXEnv@133] - ensureOnly:[]
    [junit] 2012-07-20 09:55:30,875 [myid:] - INFO  [ProcessThread(sid:0 cport:-1)::PrepRequestProcessor@142]
- PrepRequestProcessor exited loop!
    [junit] 2012-07-20 09:55:30,876 [myid:] - INFO  [main:ClientBase@414] - STARTING server
    [junit] 2012-07-20 09:55:30,876 [myid:] - INFO  [main:ZooKeeperServer@147] - Created server
with tickTime 3000 minSessionTimeout 6000 maxSessionTimeout 60000 datadir /home/jenkins/jenkins-slave/workspace/ZooKeeper-trunk-jdk7/trunk/build/test/tmp/test6648988695330957147.junit.dir/version-2
snapdir /home/jenkins/jenkins-slave/workspace/ZooKeeper-trunk-jdk7/trunk/build/test/tmp/test6648988695330957147.junit.dir/version-2
    [junit] 2012-07-20 09:55:30,877 [myid:] - INFO  [main:NIOServerCnxnFactory@108] - binding
to port 0.0.0.0/0.0.0.0:11221
    [junit] 2012-07-20 09:55:30,878 [myid:] - INFO  [main:FileSnap@83] - Reading snapshot
/home/jenkins/jenkins-slave/workspace/ZooKeeper-trunk-jdk7/trunk/build/test/tmp/test6648988695330957147.junit.dir/version-2/snapshot.b
    [junit] 2012-07-20 09:55:30,880 [myid:] - INFO  [main:FileTxnSnapLog@270] - Snapshotting:
0xb to /home/jenkins/jenkins-slave/workspace/ZooKeeper-trunk-jdk7/trunk/build/test/tmp/test6648988695330957147.junit.dir/version-2/snapshot.b
    [junit] 2012-07-20 09:55:30,881 [myid:] - INFO  [main:FourLetterWordMain@43] - connecting
to 127.0.0.1 11221
    [junit] 2012-07-20 09:55:30,882 [myid:] - INFO  [NIOServerCxn.Factory:0.0.0.0/0.0.0.0:11221:NIOServerCnxnFactory@211]
- Accepted socket connection from /127.0.0.1:51353
    [junit] 2012-07-20 09:55:30,882 [myid:] - INFO  [NIOServerCxn.Factory:0.0.0.0/0.0.0.0:11221:NIOServerCnxn@821]
- Processing stat command from /127.0.0.1:51353
    [junit] 2012-07-20 09:55:30,883 [myid:] - INFO  [Thread-4:NIOServerCnxn$StatCommand@655]
- Stat command output
    [junit] 2012-07-20 09:55:30,883 [myid:] - INFO  [Thread-4:NIOServerCnxn@1001] - Closed
socket connection for client /127.0.0.1:51353 (no session established for client)
    [junit] 2012-07-20 09:55:30,884 [myid:] - INFO  [main:JMXEnv@133] - ensureOnly:[InMemoryDataTree,
StandaloneServer_port]
    [junit] 2012-07-20 09:55:30,885 [myid:] - INFO  [main:JMXEnv@105] - expect:InMemoryDataTree
    [junit] 2012-07-20 09:55:30,885 [myid:] - INFO  [main:JMXEnv@108] - found:InMemoryDataTree
org.apache.ZooKeeperService:name0=StandaloneServer_port-1,name1=InMemoryDataTree
    [junit] 2012-07-20 09:55:30,885 [myid:] - INFO  [main:JMXEnv@105] - expect:StandaloneServer_port
    [junit] 2012-07-20 09:55:30,886 [myid:] - INFO  [main:JMXEnv@108] - found:StandaloneServer_port
org.apache.ZooKeeperService:name0=StandaloneServer_port-1
    [junit] 2012-07-20 09:55:30,886 [myid:] - INFO  [main:JUnit4ZKTestRunner$LoggedInvokeMethod@57]
- FINISHED TEST METHOD testQuota
    [junit] 2012-07-20 09:55:30,886 [myid:] - INFO  [main:ClientBase@451] - tearDown starting
    [junit] 2012-07-20 09:55:30,959 [myid:] - INFO  [main:ZooKeeper@679] - Session: 0x138a3d040ea0000
closed
    [junit] 2012-07-20 09:55:30,959 [myid:] - INFO  [main-EventThread:ClientCnxn$EventThread@511]
- EventThread shut down
    [junit] 2012-07-20 09:55:30,960 [myid:] - INFO  [main:ClientBase@421] - STOPPING server
    [junit] 2012-07-20 09:55:30,960 [myid:] - INFO  [NIOServerCxn.Factory:0.0.0.0/0.0.0.0:11221:NIOServerCnxnFactory@238]
- NIOServerCnxn factory exited run method
    [junit] 2012-07-20 09:55:30,961 [myid:] - INFO  [main:ZooKeeperServer@399] - shutting
down
    [junit] 2012-07-20 09:55:30,961 [myid:] - INFO  [main:SessionTrackerImpl@220] - Shutting
down
    [junit] 2012-07-20 09:55:30,961 [myid:] - INFO  [main:PrepRequestProcessor@733] - Shutting
down
    [junit] 2012-07-20 09:55:30,961 [myid:] - INFO  [main:SyncRequestProcessor@175] - Shutting
down
    [junit] 2012-07-20 09:55:30,961 [myid:] - INFO  [ProcessThread(sid:0 cport:-1)::PrepRequestProcessor@142]
- PrepRequestProcessor exited loop!
    [junit] 2012-07-20 09:55:30,962 [myid:] - INFO  [SyncThread:0:SyncRequestProcessor@155]
- SyncRequestProcessor exited!
    [junit] 2012-07-20 09:55:30,962 [myid:] - INFO  [main:FinalRequestProcessor@411] - shutdown
of request processor complete
    [junit] 2012-07-20 09:55:30,963 [myid:] - INFO  [main:FourLetterWordMain@43] - connecting
to 127.0.0.1 11221
    [junit] 2012-07-20 09:55:30,963 [myid:] - INFO  [main:JMXEnv@133] - ensureOnly:[]
    [junit] 2012-07-20 09:55:30,966 [myid:] - INFO  [main:ClientBase@479] - fdcount after
test is: 41 at start it was 29
    [junit] 2012-07-20 09:55:30,966 [myid:] - INFO  [main:ClientBase@481] - sleeping for 20
secs
    [junit] 2012-07-20 09:55:30,968 [myid:] - INFO  [main:ZKTestCase$1@61] - SUCCEEDED testQuota
    [junit] 2012-07-20 09:55:30,968 [myid:] - INFO  [main:ZKTestCase$1@56] - FINISHED testQuota
    [junit] Tests run: 1, Failures: 0, Errors: 0, Time elapsed: 0.561 sec

BUILD FAILED
/home/jenkins/jenkins-slave/workspace/ZooKeeper-trunk-jdk7/trunk/build.xml:1302: The following
error occurred while executing this line:
/home/jenkins/jenkins-slave/workspace/ZooKeeper-trunk-jdk7/trunk/build.xml:1213: Tests failed!

Total time: 21 minutes 41 seconds
Build step 'Execute shell' marked build as failure
[WARNINGS] Skipping publisher since build result is FAILURE
Archiving artifacts
Recording test results
Publishing Javadoc
Email was triggered for: Failure
Sending email for trigger: Failure



###################################################################################
############################## FAILED TESTS (if any) ##############################
1 tests failed.
REGRESSION:  org.apache.zookeeper.server.quorum.Zab1_0Test.testUnnecessarySnap

Error Message:
null

Stack Trace:
java.lang.NullPointerException
	at org.apache.zookeeper.server.quorum.Zab1_0Test.recursiveDelete(Zab1_0Test.java:917)
	at org.apache.zookeeper.server.quorum.Zab1_0Test.recursiveDelete(Zab1_0Test.java:918)
	at org.apache.zookeeper.server.quorum.Zab1_0Test.recursiveDelete(Zab1_0Test.java:918)
	at org.apache.zookeeper.server.quorum.Zab1_0Test.testPopulatedLeaderConversation(Zab1_0Test.java:419)
	at org.apache.zookeeper.server.quorum.Zab1_0Test.testUnnecessarySnap(Zab1_0Test.java:483)



Mime
  • Unnamed multipart/mixed (inline, None, 0 bytes)
View raw message