zookeeper-dev mailing list archives

Site index · List index
Message view « Date » · « Thread »
Top « Date » · « Thread »
From Apache Jenkins Server <jenk...@builds.apache.org>
Subject ZooKeeper-trunk - Build # 1458 - Failure
Date Mon, 13 Feb 2012 10:55:17 GMT
See https://builds.apache.org/job/ZooKeeper-trunk/1458/

###################################################################################
########################## LAST 60 LINES OF THE CONSOLE ###########################
[...truncated 175567 lines...]
     [exec] Zookeeper_simpleSystem::testAsyncWatcherAutoReset ZooKeeper server started : elapsed
12038 : OK
     [exec] Zookeeper_simpleSystem::testDeserializeString : elapsed 0 : OK
     [exec] Zookeeper_simpleSystem::testNullData : elapsed 1064 : OK
     [exec] Zookeeper_simpleSystem::testIPV6 : elapsed 1008 : OK
     [exec] Zookeeper_simpleSystem::testPath : elapsed 1013 : OK
     [exec] Zookeeper_simpleSystem::testPathValidation : elapsed 1030 : OK
     [exec] Zookeeper_simpleSystem::testPing : elapsed 17389 : OK
     [exec] Zookeeper_simpleSystem::testAcl : elapsed 1013 : OK
     [exec] Zookeeper_simpleSystem::testChroot : elapsed 3050 : OK
     [exec] Zookeeper_simpleSystem::testAuth ZooKeeper server started ZooKeeper server started
: elapsed 34120 : OK
     [exec] Zookeeper_simpleSystem::testHangingClient : elapsed 1019 : OK
     [exec] Zookeeper_simpleSystem::testWatcherAutoResetWithGlobal ZooKeeper server started
ZooKeeper server started ZooKeeper server started : elapsed 20244 : OK
     [exec] Zookeeper_simpleSystem::testWatcherAutoResetWithLocal ZooKeeper server started
ZooKeeper server started ZooKeeper server started : elapsed 20198 : OK
     [exec] Zookeeper_simpleSystem::testGetChildren2 : elapsed 1039 : OK
     [exec] Zookeeper_multi::testCreate : elapsed 1034 : OK
     [exec] Zookeeper_multi::testCreateDelete : elapsed 1030 : OK
     [exec] Zookeeper_multi::testInvalidVersion : elapsed 1008 : OK
     [exec] Zookeeper_multi::testNestedCreate : elapsed 1008 : OK
     [exec] Zookeeper_multi::testSetData : elapsed 6040 : OK
     [exec] Zookeeper_multi::testUpdateConflict : elapsed 1014 : OK
     [exec] Zookeeper_multi::testDeleteUpdateConflict : elapsed 1006 : OK
     [exec] Zookeeper_multi::testAsyncMulti : elapsed 2000 : OK
     [exec] Zookeeper_multi::testMultiFail : elapsed 1032 : OK
     [exec] Zookeeper_multi::testCheck : elapsed 1011 : OK
     [exec] Zookeeper_multi::testWatch : elapsed 2014 : OK
     [exec] Zookeeper_watchers::testDefaultSessionWatcher1 : elapsed 51 : OK
     [exec] Zookeeper_watchers::testDefaultSessionWatcher2 : elapsed 4 : OK
     [exec] Zookeeper_watchers::testObjectSessionWatcher1 : elapsed 53 : OK
     [exec] Zookeeper_watchers::testObjectSessionWatcher2 : elapsed 55 : OK
     [exec] Zookeeper_watchers::testNodeWatcher1 : elapsed 55 : OK
     [exec] Zookeeper_watchers::testChildWatcher1 : elapsed 103 : OK
     [exec] Zookeeper_watchers::testChildWatcher2 : elapsed 103 : OK
     [exec] OK (57)

test-core-cppunit:

test-core:

test-contrib:

clover.check:

BUILD FAILED
/home/jenkins/jenkins-slave/workspace/ZooKeeper-trunk/trunk/build.xml:1340: ##################################################################
        Clover not found.
        Please make sure clover.jar is in ANT_HOME/lib, or made available
        to Ant using other mechanisms like -lib or CLASSPATH.
        ##################################################################

Total time: 22 minutes 25 seconds
Build step 'Execute shell' marked build as failure
[FINDBUGS] Skipping publisher since build result is FAILURE
[WARNINGS] Skipping publisher since build result is FAILURE
Archiving artifacts
Recording fingerprints
Recording test results
Publishing Javadoc
Email was triggered for: Failure
Sending email for trigger: Failure



###################################################################################
############################## FAILED TESTS (if any) ##############################
All tests passed
Mime
  • Unnamed multipart/mixed (inline, None, 0 bytes)
View raw message