zookeeper-dev mailing list archives

Site index · List index
Message view « Date » · « Thread »
Top « Date » · « Thread »
From Apache Jenkins Server <jenk...@builds.apache.org>
Subject ZooKeeper-trunk - Build # 1447 - Still Failing
Date Thu, 02 Feb 2012 10:56:03 GMT
See https://builds.apache.org/job/ZooKeeper-trunk/1447/

###################################################################################
########################## LAST 60 LINES OF THE CONSOLE ###########################
[...truncated 150573 lines...]
     [exec] Zookeeper_simpleSystem::testNullData : elapsed 1046 : OK
     [exec] Zookeeper_simpleSystem::testIPV6 : elapsed 1008 : OK
     [exec] Zookeeper_simpleSystem::testPath : elapsed 1013 : OK
     [exec] Zookeeper_simpleSystem::testPathValidation : elapsed 1030 : OK
     [exec] Zookeeper_simpleSystem::testPing : elapsed 17347 : OK
     [exec] Zookeeper_simpleSystem::testAcl : elapsed 1020 : OK
     [exec] Zookeeper_simpleSystem::testChroot : elapsed 3035 : OK
     [exec] Zookeeper_simpleSystem::testAuth ZooKeeper server started ZooKeeper server started
: elapsed 34114 : OK
     [exec] Zookeeper_simpleSystem::testHangingClient : elapsed 1041 : OK
     [exec] Zookeeper_simpleSystem::testWatcherAutoResetWithGlobal ZooKeeper server started
ZooKeeper server started ZooKeeper server started : elapsed 20120 : OK
     [exec] Zookeeper_simpleSystem::testWatcherAutoResetWithLocal ZooKeeper server started
ZooKeeper server started ZooKeeper server started : elapsed 20198 : OK
     [exec] Zookeeper_simpleSystem::testGetChildren2 : elapsed 1023 : OK
     [exec] Zookeeper_multi::testCreate : elapsed 1033 : OK
     [exec] Zookeeper_multi::testCreateDelete : elapsed 1014 : OK
     [exec] Zookeeper_multi::testInvalidVersion : elapsed 1008 : OK
     [exec] Zookeeper_multi::testNestedCreate : elapsed 1008 : OK
     [exec] Zookeeper_multi::testSetData : elapsed 6023 : OK
     [exec] Zookeeper_multi::testUpdateConflict : elapsed 1014 : OK
     [exec] Zookeeper_multi::testDeleteUpdateConflict : elapsed 1006 : OK
     [exec] Zookeeper_multi::testAsyncMulti : elapsed 2000 : OK
     [exec] Zookeeper_multi::testMultiFail : elapsed 1008 : OK
     [exec] Zookeeper_multi::testCheck : elapsed 1017 : OK
     [exec] Zookeeper_multi::testWatch : elapsed 2016 : OK
     [exec] Zookeeper_watchers::testDefaultSessionWatcher1 : elapsed 51 : OK
     [exec] Zookeeper_watchers::testDefaultSessionWatcher2 : elapsed 4 : OK
     [exec] Zookeeper_watchers::testObjectSessionWatcher1 : elapsed 53 : OK
     [exec] Zookeeper_watchers::testObjectSessionWatcher2 : elapsed 55 : OK
     [exec] Zookeeper_watchers::testNodeWatcher1 : elapsed 55 : OK
     [exec] Zookeeper_watchers::testChildWatcher1 : elapsed 102 : OK
     [exec] Zookeeper_watchers::testChildWatcher2 : elapsed 102 : OK
     [exec] OK (57)

test-core-cppunit:

test-core:

test-contrib:

clover.check:

BUILD FAILED
/home/jenkins/jenkins-slave/workspace/ZooKeeper-trunk/trunk/build.xml:1340: ##################################################################
        Clover not found.
        Please make sure clover.jar is in ANT_HOME/lib, or made available
        to Ant using other mechanisms like -lib or CLASSPATH.
        ##################################################################

Total time: 22 minutes 16 seconds
Build step 'Execute shell' marked build as failure
[FINDBUGS] Skipping publisher since build result is FAILURE
[WARNINGS] Skipping publisher since build result is FAILURE
Archiving artifacts
Recording fingerprints
Recording test results
Publishing Javadoc
Publishing Clover coverage report...
No Clover report will be published due to a Build Failure
Email was triggered for: Failure
Sending email for trigger: Failure



###################################################################################
############################## FAILED TESTS (if any) ##############################
All tests passed

Mime
View raw message