zookeeper-dev mailing list archives

Site index · List index
Message view « Date » · « Thread »
Top « Date » · « Thread »
From Apache Jenkins Server <jenk...@builds.apache.org>
Subject ZooKeeper-trunk - Build # 1456 - Failure
Date Sat, 11 Feb 2012 00:17:23 GMT
See https://builds.apache.org/job/ZooKeeper-trunk/1456/

###################################################################################
########################## LAST 60 LINES OF THE CONSOLE ###########################
[...truncated 148631 lines...]
    [junit] 2012-02-11 00:06:47,722 [myid:] - INFO  [main:SyncRequestProcessor@173] - Shutting
down
    [junit] 2012-02-11 00:06:47,722 [myid:] - INFO  [ProcessThread(sid:0 cport:-1)::PrepRequestProcessor@134]
- PrepRequestProcessor exited loop!
    [junit] 2012-02-11 00:06:47,722 [myid:] - INFO  [SyncThread:0:SyncRequestProcessor@155]
- SyncRequestProcessor exited!
    [junit] 2012-02-11 00:06:47,723 [myid:] - INFO  [main:FinalRequestProcessor@410] - shutdown
of request processor complete
    [junit] 2012-02-11 00:06:47,723 [myid:] - INFO  [main:FourLetterWordMain@43] - connecting
to 127.0.0.1 11221
    [junit] 2012-02-11 00:06:47,724 [myid:] - INFO  [main:JMXEnv@133] - ensureOnly:[]
    [junit] 2012-02-11 00:06:47,725 [myid:] - INFO  [main:ClientBase@407] - STARTING server
    [junit] 2012-02-11 00:06:47,725 [myid:] - INFO  [main:ZooKeeperServer@146] - Created server
with tickTime 3000 minSessionTimeout 6000 maxSessionTimeout 60000 datadir /home/jenkins/jenkins-slave/workspace/ZooKeeper-trunk/trunk/build/test/tmp/test8742301029165841580.junit.dir/version-2
snapdir /home/jenkins/jenkins-slave/workspace/ZooKeeper-trunk/trunk/build/test/tmp/test8742301029165841580.junit.dir/version-2
    [junit] 2012-02-11 00:06:47,725 [myid:] - INFO  [main:NIOServerCnxnFactory@108] - binding
to port 0.0.0.0/0.0.0.0:11221
    [junit] 2012-02-11 00:06:47,726 [myid:] - INFO  [main:FileSnap@83] - Reading snapshot
/home/jenkins/jenkins-slave/workspace/ZooKeeper-trunk/trunk/build/test/tmp/test8742301029165841580.junit.dir/version-2/snapshot.b
    [junit] 2012-02-11 00:06:47,729 [myid:] - INFO  [main:FileTxnSnapLog@238] - Snapshotting:
0xb to /home/jenkins/jenkins-slave/workspace/ZooKeeper-trunk/trunk/build/test/tmp/test8742301029165841580.junit.dir/version-2/snapshot.b
    [junit] 2012-02-11 00:06:47,730 [myid:] - INFO  [main:FourLetterWordMain@43] - connecting
to 127.0.0.1 11221
    [junit] 2012-02-11 00:06:47,731 [myid:] - INFO  [NIOServerCxn.Factory:0.0.0.0/0.0.0.0:11221:NIOServerCnxnFactory@211]
- Accepted socket connection from /127.0.0.1:37290
    [junit] 2012-02-11 00:06:47,731 [myid:] - INFO  [NIOServerCxn.Factory:0.0.0.0/0.0.0.0:11221:NIOServerCnxn@821]
- Processing stat command from /127.0.0.1:37290
    [junit] 2012-02-11 00:06:47,731 [myid:] - INFO  [Thread-5:NIOServerCnxn$StatCommand@655]
- Stat command output
    [junit] 2012-02-11 00:06:47,732 [myid:] - INFO  [Thread-5:NIOServerCnxn@1001] - Closed
socket connection for client /127.0.0.1:37290 (no session established for client)
    [junit] 2012-02-11 00:06:47,732 [myid:] - INFO  [main:JMXEnv@133] - ensureOnly:[InMemoryDataTree,
StandaloneServer_port]
    [junit] 2012-02-11 00:06:47,733 [myid:] - INFO  [main:JMXEnv@105] - expect:InMemoryDataTree
    [junit] 2012-02-11 00:06:47,733 [myid:] - INFO  [main:JMXEnv@108] - found:InMemoryDataTree
org.apache.ZooKeeperService:name0=StandaloneServer_port-1,name1=InMemoryDataTree
    [junit] 2012-02-11 00:06:47,734 [myid:] - INFO  [main:JMXEnv@105] - expect:StandaloneServer_port
    [junit] 2012-02-11 00:06:47,734 [myid:] - INFO  [main:JMXEnv@108] - found:StandaloneServer_port
org.apache.ZooKeeperService:name0=StandaloneServer_port-1
    [junit] 2012-02-11 00:06:47,734 [myid:] - INFO  [main:JUnit4ZKTestRunner$LoggedInvokeMethod@57]
- FINISHED TEST METHOD testQuota
    [junit] 2012-02-11 00:06:47,734 [myid:] - INFO  [main:ClientBase@444] - tearDown starting
    [junit] 2012-02-11 00:06:47,807 [myid:] - INFO  [main:ZooKeeper@679] - Session: 0x13569bbc40b0000
closed
    [junit] 2012-02-11 00:06:47,807 [myid:] - INFO  [main-EventThread:ClientCnxn$EventThread@511]
- EventThread shut down
    [junit] 2012-02-11 00:06:47,807 [myid:] - INFO  [main:ClientBase@414] - STOPPING server
    [junit] 2012-02-11 00:06:47,808 [myid:] - INFO  [NIOServerCxn.Factory:0.0.0.0/0.0.0.0:11221:NIOServerCnxnFactory@238]
- NIOServerCnxn factory exited run method
    [junit] 2012-02-11 00:06:47,808 [myid:] - INFO  [main:ZooKeeperServer@398] - shutting
down
    [junit] 2012-02-11 00:06:47,808 [myid:] - INFO  [main:SessionTrackerImpl@220] - Shutting
down
    [junit] 2012-02-11 00:06:47,808 [myid:] - INFO  [main:PrepRequestProcessor@712] - Shutting
down
    [junit] 2012-02-11 00:06:47,808 [myid:] - INFO  [main:SyncRequestProcessor@173] - Shutting
down
    [junit] 2012-02-11 00:06:47,808 [myid:] - INFO  [ProcessThread(sid:0 cport:-1)::PrepRequestProcessor@134]
- PrepRequestProcessor exited loop!
    [junit] 2012-02-11 00:06:47,809 [myid:] - INFO  [SyncThread:0:SyncRequestProcessor@155]
- SyncRequestProcessor exited!
    [junit] 2012-02-11 00:06:47,809 [myid:] - INFO  [main:FinalRequestProcessor@410] - shutdown
of request processor complete
    [junit] 2012-02-11 00:06:47,809 [myid:] - INFO  [main:FourLetterWordMain@43] - connecting
to 127.0.0.1 11221
    [junit] 2012-02-11 00:06:47,810 [myid:] - INFO  [main:JMXEnv@133] - ensureOnly:[]
    [junit] 2012-02-11 00:06:47,813 [myid:] - INFO  [main:ClientBase@472] - fdcount after
test is: 39 at start it was 26
    [junit] 2012-02-11 00:06:47,813 [myid:] - INFO  [main:ClientBase@474] - sleeping for 20
secs
    [junit] 2012-02-11 00:06:47,814 [myid:] - INFO  [main:ZKTestCase$1@61] - SUCCEEDED testQuota
    [junit] 2012-02-11 00:06:47,814 [myid:] - INFO  [main:ZKTestCase$1@56] - FINISHED testQuota
    [junit] Tests run: 1, Failures: 0, Errors: 0, Time elapsed: 0.51 sec

BUILD FAILED
/home/jenkins/jenkins-slave/workspace/ZooKeeper-trunk/trunk/build.xml:1301: The following
error occurred while executing this line:
/home/jenkins/jenkins-slave/workspace/ZooKeeper-trunk/trunk/build.xml:1212: Tests failed!

Total time: 26 minutes 0 seconds
Build step 'Execute shell' marked build as failure
[FINDBUGS] Skipping publisher since build result is FAILURE
[WARNINGS] Skipping publisher since build result is FAILURE
Archiving artifacts
Recording fingerprints
Updating ZOOKEEPER-1321
Recording test results
Publishing Javadoc
Publishing Clover coverage report...
No Clover report will be published due to a Build Failure
Email was triggered for: Failure
Sending email for trigger: Failure



###################################################################################
############################## FAILED TESTS (if any) ##############################
4 tests failed.
REGRESSION:  org.apache.zookeeper.test.FLETest.testSingleElection

Error Message:
Fewer than a a majority has joined

Stack Trace:
junit.framework.AssertionFailedError: Fewer than a a majority has joined
	at org.apache.zookeeper.test.FLETest.runElection(FLETest.java:347)
	at org.apache.zookeeper.test.FLETest.testSingleElection(FLETest.java:258)
	at org.apache.zookeeper.JUnit4ZKTestRunner$LoggedInvokeMethod.evaluate(JUnit4ZKTestRunner.java:52)


REGRESSION:  org.apache.zookeeper.test.FLEZeroWeightTest.testZeroWeightQuorum

Error Message:
Threads didn't join

Stack Trace:
junit.framework.AssertionFailedError: Threads didn't join
	at org.apache.zookeeper.test.FLEZeroWeightTest.testZeroWeightQuorum(FLEZeroWeightTest.java:168)
	at org.apache.zookeeper.JUnit4ZKTestRunner$LoggedInvokeMethod.evaluate(JUnit4ZKTestRunner.java:52)


REGRESSION:  org.apache.zookeeper.test.LETest.testLE

Error Message:
Threads didn't join

Stack Trace:
junit.framework.AssertionFailedError: Threads didn't join
	at org.apache.zookeeper.test.LETest.testLE(LETest.java:123)
	at org.apache.zookeeper.JUnit4ZKTestRunner$LoggedInvokeMethod.evaluate(JUnit4ZKTestRunner.java:52)


REGRESSION:  org.apache.zookeeper.test.LoadFromLogTest.testRestoreWithTransactionErrors

Error Message:
KeeperErrorCode = ConnectionLoss for /invaliddir/test-

Stack Trace:
org.apache.zookeeper.KeeperException$ConnectionLossException: KeeperErrorCode = ConnectionLoss
for /invaliddir/test-
	at org.apache.zookeeper.KeeperException.create(KeeperException.java:99)
	at org.apache.zookeeper.KeeperException.create(KeeperException.java:51)
	at org.apache.zookeeper.ZooKeeper.create(ZooKeeper.java:778)
	at org.apache.zookeeper.test.LoadFromLogTest.testRestoreWithTransactionErrors(LoadFromLogTest.java:407)
	at org.apache.zookeeper.JUnit4ZKTestRunner$LoggedInvokeMethod.evaluate(JUnit4ZKTestRunner.java:52)




Mime
View raw message