zookeeper-dev mailing list archives

Site index · List index
Message view « Date » · « Thread »
Top « Date » · « Thread »
From Apache Jenkins Server <jenk...@builds.apache.org>
Subject ZooKeeper_branch33 - Build # 515 - Failure
Date Tue, 21 Feb 2012 10:02:12 GMT
See https://builds.apache.org/job/ZooKeeper_branch33/515/

###################################################################################
########################## LAST 60 LINES OF THE CONSOLE ###########################
[...truncated 78240 lines...]
    [junit] 2012-02-21 09:54:59,401 - INFO  [main:ZooKeeperServer@153] - Created server with
tickTime 3000 minSessionTimeout 6000 maxSessionTimeout 60000 datadir /home/jenkins/jenkins-slave/workspace/ZooKeeper_branch33/branch-3.3/build/test/tmp/test1808242618401814983.junit.dir/version-2
snapdir /home/jenkins/jenkins-slave/workspace/ZooKeeper_branch33/branch-3.3/build/test/tmp/test1808242618401814983.junit.dir/version-2
    [junit] 2012-02-21 09:54:59,401 - INFO  [main:NIOServerCnxn$Factory@143] - binding to
port 0.0.0.0/0.0.0.0:11221
    [junit] 2012-02-21 09:54:59,403 - INFO  [main:FileSnap@82] - Reading snapshot /home/jenkins/jenkins-slave/workspace/ZooKeeper_branch33/branch-3.3/build/test/tmp/test1808242618401814983.junit.dir/version-2/snapshot.0
    [junit] 2012-02-21 09:54:59,406 - INFO  [main:FileTxnSnapLog@254] - Snapshotting: b
    [junit] 2012-02-21 09:54:59,408 - INFO  [main:FourLetterWordMain@43] - connecting to 127.0.0.1
11221
    [junit] 2012-02-21 09:54:59,409 - INFO  [NIOServerCxn.Factory:0.0.0.0/0.0.0.0:11221:NIOServerCnxn$Factory@251]
- Accepted socket connection from /127.0.0.1:47840
    [junit] 2012-02-21 09:54:59,409 - INFO  [NIOServerCxn.Factory:0.0.0.0/0.0.0.0:11221:NIOServerCnxn@1237]
- Processing stat command from /127.0.0.1:47840
    [junit] 2012-02-21 09:54:59,410 - INFO  [Thread-4:NIOServerCnxn$StatCommand@1153] - Stat
command output
    [junit] 2012-02-21 09:54:59,410 - INFO  [Thread-4:NIOServerCnxn@1435] - Closed socket
connection for client /127.0.0.1:47840 (no session established for client)
    [junit] ensureOnly:[InMemoryDataTree, StandaloneServer_port]
    [junit] expect:InMemoryDataTree
    [junit] found:InMemoryDataTree org.apache.ZooKeeperService:name0=StandaloneServer_port-1,name1=InMemoryDataTree
    [junit] expect:StandaloneServer_port
    [junit] found:StandaloneServer_port org.apache.ZooKeeperService:name0=StandaloneServer_port-1
    [junit] 2012-02-21 09:54:59,412 - INFO  [main:ClientBase@385] - STOPPING server
    [junit] 2012-02-21 09:54:59,412 - INFO  [NIOServerCxn.Factory:0.0.0.0/0.0.0.0:11221:NIOServerCnxn$Factory@278]
- NIOServerCnxn factory exited run method
    [junit] 2012-02-21 09:54:59,413 - INFO  [ProcessThread:-1:PrepRequestProcessor@120] -
PrepRequestProcessor exited loop!
    [junit] 2012-02-21 09:54:59,413 - INFO  [SyncThread:0:SyncRequestProcessor@151] - SyncRequestProcessor
exited!
    [junit] 2012-02-21 09:54:59,413 - INFO  [main:FinalRequestProcessor@369] - shutdown of
request processor complete
    [junit] 2012-02-21 09:54:59,414 - INFO  [main:FourLetterWordMain@43] - connecting to 127.0.0.1
11221
    [junit] ensureOnly:[]
    [junit] 2012-02-21 09:54:59,415 - INFO  [main:ClientBase@378] - STARTING server
    [junit] 2012-02-21 09:54:59,416 - INFO  [main:ZooKeeperServer@153] - Created server with
tickTime 3000 minSessionTimeout 6000 maxSessionTimeout 60000 datadir /home/jenkins/jenkins-slave/workspace/ZooKeeper_branch33/branch-3.3/build/test/tmp/test1808242618401814983.junit.dir/version-2
snapdir /home/jenkins/jenkins-slave/workspace/ZooKeeper_branch33/branch-3.3/build/test/tmp/test1808242618401814983.junit.dir/version-2
    [junit] 2012-02-21 09:54:59,416 - INFO  [main:NIOServerCnxn$Factory@143] - binding to
port 0.0.0.0/0.0.0.0:11221
    [junit] 2012-02-21 09:54:59,417 - INFO  [main:FileSnap@82] - Reading snapshot /home/jenkins/jenkins-slave/workspace/ZooKeeper_branch33/branch-3.3/build/test/tmp/test1808242618401814983.junit.dir/version-2/snapshot.b
    [junit] 2012-02-21 09:54:59,420 - INFO  [main:FileTxnSnapLog@254] - Snapshotting: b
    [junit] 2012-02-21 09:54:59,422 - INFO  [main:FourLetterWordMain@43] - connecting to 127.0.0.1
11221
    [junit] 2012-02-21 09:54:59,422 - INFO  [NIOServerCxn.Factory:0.0.0.0/0.0.0.0:11221:NIOServerCnxn$Factory@251]
- Accepted socket connection from /127.0.0.1:47842
    [junit] 2012-02-21 09:54:59,423 - INFO  [NIOServerCxn.Factory:0.0.0.0/0.0.0.0:11221:NIOServerCnxn@1237]
- Processing stat command from /127.0.0.1:47842
    [junit] 2012-02-21 09:54:59,423 - INFO  [Thread-5:NIOServerCnxn$StatCommand@1153] - Stat
command output
    [junit] 2012-02-21 09:54:59,424 - INFO  [Thread-5:NIOServerCnxn@1435] - Closed socket
connection for client /127.0.0.1:47842 (no session established for client)
    [junit] ensureOnly:[InMemoryDataTree, StandaloneServer_port]
    [junit] expect:InMemoryDataTree
    [junit] found:InMemoryDataTree org.apache.ZooKeeperService:name0=StandaloneServer_port-1,name1=InMemoryDataTree
    [junit] expect:StandaloneServer_port
    [junit] found:StandaloneServer_port org.apache.ZooKeeperService:name0=StandaloneServer_port-1
    [junit] 2012-02-21 09:54:59,425 - INFO  [main:ClientBase@408] - tearDown starting
    [junit] 2012-02-21 09:54:59,426 - INFO  [main:ClientBase@420] - fdcount after test is:
35
    [junit] 2012-02-21 09:54:59,497 - INFO  [main:ZooKeeper@544] - Session: 0x1359f55de4c0000
closed
    [junit] 2012-02-21 09:54:59,497 - INFO  [main-EventThread:ClientCnxn$EventThread@521]
- EventThread shut down
    [junit] 2012-02-21 09:54:59,498 - INFO  [main:ClientBase@385] - STOPPING server
    [junit] 2012-02-21 09:54:59,498 - INFO  [NIOServerCxn.Factory:0.0.0.0/0.0.0.0:11221:NIOServerCnxn$Factory@278]
- NIOServerCnxn factory exited run method
    [junit] 2012-02-21 09:54:59,499 - INFO  [ProcessThread:-1:PrepRequestProcessor@120] -
PrepRequestProcessor exited loop!
    [junit] 2012-02-21 09:54:59,499 - INFO  [SyncThread:0:SyncRequestProcessor@151] - SyncRequestProcessor
exited!
    [junit] 2012-02-21 09:54:59,499 - INFO  [main:FinalRequestProcessor@369] - shutdown of
request processor complete
    [junit] 2012-02-21 09:54:59,500 - INFO  [main:FourLetterWordMain@43] - connecting to 127.0.0.1
11221
    [junit] ensureOnly:[]
    [junit] 2012-02-21 09:54:59,503 - INFO  [main:ClientBase@437] - FINISHED testQuota
    [junit] 2012-02-21 09:54:59,504 - INFO  [main:ZooKeeperQuotaTest@52] - STOPPING org.apache.zookeeper.test.ZooKeeperQuotaTest
    [junit] Tests run: 1, Failures: 0, Errors: 0, Time elapsed: 0.473 sec

BUILD FAILED
/home/jenkins/jenkins-slave/workspace/ZooKeeper_branch33/branch-3.3/build.xml:845: Tests failed!

Total time: 22 minutes 41 seconds
Build step 'Execute shell' marked build as failure
Recording test results
Email was triggered for: Failure
Sending email for trigger: Failure



###################################################################################
############################## FAILED TESTS (if any) ##############################
3 tests failed.
REGRESSION:  org.apache.zookeeper.test.LETest.testLE

Error Message:
Threads didn't join

Stack Trace:
junit.framework.AssertionFailedError: Threads didn't join
	at org.apache.zookeeper.test.LETest.testLE(LETest.java:118)


REGRESSION:  org.apache.zookeeper.test.QuorumTest.testSessionMove

Error Message:
KeeperErrorCode = ConnectionLoss for /t-8

Stack Trace:
org.apache.zookeeper.KeeperException$ConnectionLossException: KeeperErrorCode = ConnectionLoss
for /t-8
	at org.apache.zookeeper.KeeperException.create(KeeperException.java:90)
	at org.apache.zookeeper.KeeperException.create(KeeperException.java:42)
	at org.apache.zookeeper.ZooKeeper.create(ZooKeeper.java:643)
	at org.apache.zookeeper.test.QuorumTest.testSessionMove(QuorumTest.java:258)


REGRESSION:  org.apache.zookeeper.test.QuorumZxidSyncTest.testBehindLeader

Error Message:
Servers didn't come up

Stack Trace:
junit.framework.AssertionFailedError: Servers didn't come up
	at org.apache.zookeeper.test.QuorumZxidSyncTest.testBehindLeader(QuorumZxidSyncTest.java:92)



Mime
  • Unnamed multipart/mixed (inline, None, 0 bytes)
View raw message