zookeeper-dev mailing list archives

Site index · List index
Message view « Date » · « Thread »
Top « Date » · « Thread »
From Apache Jenkins Server <jenk...@builds.apache.org>
Subject ZooKeeper_branch34 - Build # 143 - Failure
Date Sat, 04 Feb 2012 09:10:46 GMT
See https://builds.apache.org/job/ZooKeeper_branch34/143/

###################################################################################
########################## LAST 60 LINES OF THE CONSOLE ###########################
[...truncated 65543 lines...]
	at hudson.model.AbstractBuild$AbstractRunner.perform(AbstractBuild.java:697)
	at hudson.model.Build$RunnerImpl.build(Build.java:178)
	at hudson.model.Build$RunnerImpl.doRun(Build.java:139)
	at hudson.model.AbstractBuild$AbstractRunner.run(AbstractBuild.java:467)
	at hudson.model.Run.run(Run.java:1404)
	at hudson.model.FreeStyleBuild.run(FreeStyleBuild.java:46)
	at hudson.model.ResourceController.execute(ResourceController.java:88)
	at hudson.model.Executor.run(Executor.java:238)
Caused by: hudson.remoting.ChannelClosedException: channel is already closed
	at hudson.remoting.Channel.send(Channel.java:499)
	at hudson.remoting.Request.call(Request.java:110)
	at hudson.remoting.Channel.call(Channel.java:681)
	at hudson.FilePath.act(FilePath.java:773)
	... 13 more
Caused by: hudson.remoting.Channel$OrderlyShutdown
	at hudson.remoting.Channel$CloseCommand.execute(Channel.java:830)
	at hudson.remoting.Channel$ReaderThread.run(Channel.java:1128)
Caused by: Command close created at
	at hudson.remoting.Command.<init>(Command.java:51)
	at hudson.remoting.Channel$CloseCommand.<init>(Channel.java:824)
	at hudson.remoting.Channel$CloseCommand.<init>(Channel.java:822)
	at hudson.remoting.Channel.close(Channel.java:889)
	at hudson.remoting.Channel.close(Channel.java:872)
	at hudson.remoting.Channel$CloseCommand.execute(Channel.java:829)
	... 1 more
FATAL: hudson.remoting.RequestAbortedException: hudson.remoting.Channel$OrderlyShutdown
hudson.remoting.RequestAbortedException: hudson.remoting.RequestAbortedException: hudson.remoting.Channel$OrderlyShutdown
	at hudson.remoting.Request.call(Request.java:149)
	at hudson.remoting.Channel.call(Channel.java:681)
	at hudson.remoting.RemoteInvocationHandler.invoke(RemoteInvocationHandler.java:158)
	at $Proxy31.join(Unknown Source)
	at hudson.Launcher$RemoteLauncher$ProcImpl.join(Launcher.java:859)
	at hudson.Launcher$ProcStarter.join(Launcher.java:345)
	at hudson.tasks.CommandInterpreter.perform(CommandInterpreter.java:82)
	at hudson.tasks.CommandInterpreter.perform(CommandInterpreter.java:58)
	at hudson.tasks.BuildStepMonitor$1.perform(BuildStepMonitor.java:19)
	at hudson.model.AbstractBuild$AbstractRunner.perform(AbstractBuild.java:697)
	at hudson.model.Build$RunnerImpl.build(Build.java:178)
	at hudson.model.Build$RunnerImpl.doRun(Build.java:139)
	at hudson.model.AbstractBuild$AbstractRunner.run(AbstractBuild.java:467)
	at hudson.model.Run.run(Run.java:1404)
	at hudson.model.FreeStyleBuild.run(FreeStyleBuild.java:46)
	at hudson.model.ResourceController.execute(ResourceController.java:88)
	at hudson.model.Executor.run(Executor.java:238)
Caused by: hudson.remoting.RequestAbortedException: hudson.remoting.Channel$OrderlyShutdown
	at hudson.remoting.Request.abort(Request.java:273)
	at hudson.remoting.Channel.terminate(Channel.java:732)
	at hudson.remoting.Channel$CloseCommand.execute(Channel.java:830)
	at hudson.remoting.Channel$ReaderThread.run(Channel.java:1128)
Caused by: hudson.remoting.Channel$OrderlyShutdown
	... 2 more
Caused by: Command close created at
	at hudson.remoting.Command.<init>(Command.java:51)
	at hudson.remoting.Channel$CloseCommand.<init>(Channel.java:824)
	at hudson.remoting.Channel$CloseCommand.<init>(Channel.java:822)
	at hudson.remoting.Channel.close(Channel.java:889)
	at hudson.remoting.Channel.close(Channel.java:872)
	at hudson.remoting.Channel$CloseCommand.execute(Channel.java:829)
	... 1 more



###################################################################################
############################## FAILED TESTS (if any) ##############################
No tests ran.

Mime
View raw message