zookeeper-dev mailing list archives

Site index · List index
Message view « Date » · « Thread »
Top « Date » · « Thread »
From Apache Jenkins Server <jenk...@builds.apache.org>
Subject ZooKeeper-trunk-solaris - Build # 122 - Failure
Date Wed, 01 Feb 2012 09:19:06 GMT
See https://builds.apache.org/job/ZooKeeper-trunk-solaris/122/

###################################################################################
########################## LAST 60 LINES OF THE CONSOLE ###########################
[...truncated 143978 lines...]
    [junit] 2012-02-01 09:17:29,204 [myid:] - INFO  [main:JMXEnv@105] - expect:InMemoryDataTree
    [junit] 2012-02-01 09:17:29,204 [myid:] - INFO  [main:JMXEnv@108] - found:InMemoryDataTree
org.apache.ZooKeeperService:name0=StandaloneServer_port-1,name1=InMemoryDataTree
    [junit] 2012-02-01 09:17:29,205 [myid:] - INFO  [main:JMXEnv@105] - expect:StandaloneServer_port
    [junit] 2012-02-01 09:17:29,205 [myid:] - INFO  [main:JMXEnv@108] - found:StandaloneServer_port
org.apache.ZooKeeperService:name0=StandaloneServer_port-1
    [junit] 2012-02-01 09:17:29,205 [myid:] - INFO  [main:ClientBase@417] - STOPPING server
    [junit] 2012-02-01 09:17:29,205 [myid:] - INFO  [main:ZooKeeperServer@399] - shutting
down
    [junit] 2012-02-01 09:17:29,206 [myid:] - INFO  [main:SessionTrackerImpl@220] - Shutting
down
    [junit] 2012-02-01 09:17:29,206 [myid:] - INFO  [main:PrepRequestProcessor@711] - Shutting
down
    [junit] 2012-02-01 09:17:29,206 [myid:] - INFO  [main:SyncRequestProcessor@173] - Shutting
down
    [junit] 2012-02-01 09:17:29,206 [myid:] - INFO  [ProcessThread(sid:0 cport:-1)::PrepRequestProcessor@134]
- PrepRequestProcessor exited loop!
    [junit] 2012-02-01 09:17:29,206 [myid:] - INFO  [SyncThread:0:SyncRequestProcessor@155]
- SyncRequestProcessor exited!
    [junit] 2012-02-01 09:17:29,206 [myid:] - INFO  [main:FinalRequestProcessor@410] - shutdown
of request processor complete
    [junit] 2012-02-01 09:17:29,207 [myid:] - INFO  [main:FourLetterWordMain@43] - connecting
to 127.0.0.1 11221
    [junit] 2012-02-01 09:17:29,207 [myid:] - INFO  [main:JMXEnv@133] - ensureOnly:[]
    [junit] 2012-02-01 09:17:29,208 [myid:] - INFO  [main:ClientBase@410] - STARTING server
    [junit] 2012-02-01 09:17:29,208 [myid:] - INFO  [main:ZooKeeperServer@146] - Created server
with tickTime 3000 minSessionTimeout 6000 maxSessionTimeout 60000 datadir /zonestorage/hudson_solaris/home/hudson/hudson-slave/workspace/ZooKeeper-trunk-solaris/trunk/build/test/tmp/test9079061285015383637.junit.dir/version-2
snapdir /zonestorage/hudson_solaris/home/hudson/hudson-slave/workspace/ZooKeeper-trunk-solaris/trunk/build/test/tmp/test9079061285015383637.junit.dir/version-2
    [junit] 2012-02-01 09:17:29,209 [myid:] - INFO  [main:NIOServerCnxnFactory@110] - binding
to port 0.0.0.0/0.0.0.0:11221
    [junit] 2012-02-01 09:17:29,209 [myid:] - INFO  [main:FileSnap@83] - Reading snapshot
/zonestorage/hudson_solaris/home/hudson/hudson-slave/workspace/ZooKeeper-trunk-solaris/trunk/build/test/tmp/test9079061285015383637.junit.dir/version-2/snapshot.b
    [junit] 2012-02-01 09:17:29,211 [myid:] - INFO  [main:FileTxnSnapLog@237] - Snapshotting:
b
    [junit] 2012-02-01 09:17:29,212 [myid:] - INFO  [main:FourLetterWordMain@43] - connecting
to 127.0.0.1 11221
    [junit] 2012-02-01 09:17:29,212 [myid:] - INFO  [NIOServerCxn.Factory:0.0.0.0/0.0.0.0:11221:NIOServerCnxnFactory@213]
- Accepted socket connection from /127.0.0.1:34531
    [junit] 2012-02-01 09:17:29,213 [myid:] - INFO  [NIOServerCxn.Factory:0.0.0.0/0.0.0.0:11221:NIOServerCnxn@820]
- Processing stat command from /127.0.0.1:34531
    [junit] 2012-02-01 09:17:29,213 [myid:] - INFO  [Thread-5:NIOServerCnxn$StatCommand@655]
- Stat command output
    [junit] 2012-02-01 09:17:29,213 [myid:] - INFO  [Thread-5:NIOServerCnxn@1000] - Closed
socket connection for client /127.0.0.1:34531 (no session established for client)
    [junit] 2012-02-01 09:17:29,213 [myid:] - INFO  [main:JMXEnv@133] - ensureOnly:[InMemoryDataTree,
StandaloneServer_port]
    [junit] 2012-02-01 09:17:29,214 [myid:] - INFO  [main:JMXEnv@105] - expect:InMemoryDataTree
    [junit] 2012-02-01 09:17:29,215 [myid:] - INFO  [main:JMXEnv@108] - found:InMemoryDataTree
org.apache.ZooKeeperService:name0=StandaloneServer_port-1,name1=InMemoryDataTree
    [junit] 2012-02-01 09:17:29,215 [myid:] - INFO  [main:JMXEnv@105] - expect:StandaloneServer_port
    [junit] 2012-02-01 09:17:29,215 [myid:] - INFO  [main:JMXEnv@108] - found:StandaloneServer_port
org.apache.ZooKeeperService:name0=StandaloneServer_port-1
    [junit] 2012-02-01 09:17:29,215 [myid:] - INFO  [main:JUnit4ZKTestRunner$LoggedInvokeMethod@57]
- FINISHED TEST METHOD testQuota
    [junit] 2012-02-01 09:17:29,215 [myid:] - INFO  [main:ClientBase@447] - tearDown starting
    [junit] 2012-02-01 09:17:29,300 [myid:] - INFO  [main:ZooKeeper@679] - Session: 0x135383455230000
closed
    [junit] 2012-02-01 09:17:29,300 [myid:] - INFO  [main-EventThread:ClientCnxn$EventThread@511]
- EventThread shut down
    [junit] 2012-02-01 09:17:29,300 [myid:] - INFO  [main:ClientBase@417] - STOPPING server
    [junit] 2012-02-01 09:17:29,301 [myid:] - INFO  [main:ZooKeeperServer@399] - shutting
down
    [junit] 2012-02-01 09:17:29,301 [myid:] - INFO  [main:SessionTrackerImpl@220] - Shutting
down
    [junit] 2012-02-01 09:17:29,301 [myid:] - INFO  [main:PrepRequestProcessor@711] - Shutting
down
    [junit] 2012-02-01 09:17:29,301 [myid:] - INFO  [main:SyncRequestProcessor@173] - Shutting
down
    [junit] 2012-02-01 09:17:29,302 [myid:] - INFO  [ProcessThread(sid:0 cport:-1)::PrepRequestProcessor@134]
- PrepRequestProcessor exited loop!
    [junit] 2012-02-01 09:17:29,302 [myid:] - INFO  [SyncThread:0:SyncRequestProcessor@155]
- SyncRequestProcessor exited!
    [junit] 2012-02-01 09:17:29,302 [myid:] - INFO  [main:FinalRequestProcessor@410] - shutdown
of request processor complete
    [junit] 2012-02-01 09:17:29,302 [myid:] - INFO  [main:FourLetterWordMain@43] - connecting
to 127.0.0.1 11221
    [junit] 2012-02-01 09:17:29,303 [myid:] - INFO  [main:JMXEnv@133] - ensureOnly:[]
    [junit] 2012-02-01 09:17:29,306 [myid:] - INFO  [main:ClientBase@475] - fdcount after
test is: 44 at start it was 30
    [junit] 2012-02-01 09:17:29,306 [myid:] - INFO  [main:ClientBase@477] - sleeping for 20
secs
    [junit] 2012-02-01 09:17:29,307 [myid:] - INFO  [main:ZKTestCase$1@61] - SUCCEEDED testQuota
    [junit] 2012-02-01 09:17:29,307 [myid:] - INFO  [main:ZKTestCase$1@56] - FINISHED testQuota
    [junit] Tests run: 1, Failures: 0, Errors: 0, Time elapsed: 2.369 sec

BUILD FAILED
/zonestorage/hudson_solaris/home/hudson/hudson-slave/workspace/ZooKeeper-trunk-solaris/trunk/build.xml:1212:
Tests failed!

Total time: 44 minutes 21 seconds
Build step 'Invoke Ant' marked build as failure
[locks-and-latches] Releasing all the locks
[locks-and-latches] All the locks released
Recording test results
Email was triggered for: Failure
Sending email for trigger: Failure



###################################################################################
############################## FAILED TESTS (if any) ##############################
8 tests failed.
REGRESSION:  org.apache.zookeeper.server.quorum.QuorumPeerMainTest.testHighestZxidJoinLate

Error Message:
Waiting too long

Stack Trace:
java.lang.RuntimeException: Waiting too long
	at org.apache.zookeeper.server.quorum.QuorumPeerMainTest.waitForAll(QuorumPeerMainTest.java:320)
	at org.apache.zookeeper.server.quorum.QuorumPeerMainTest.LaunchServers(QuorumPeerMainTest.java:366)
	at org.apache.zookeeper.server.quorum.QuorumPeerMainTest.testHighestZxidJoinLate(QuorumPeerMainTest.java:218)
	at org.apache.zookeeper.JUnit4ZKTestRunner$LoggedInvokeMethod.evaluate(JUnit4ZKTestRunner.java:52)


REGRESSION:  org.apache.zookeeper.test.FLETest.testSingleElection

Error Message:
Fewer than a a majority has joined

Stack Trace:
junit.framework.AssertionFailedError: Fewer than a a majority has joined
	at org.apache.zookeeper.test.FLETest.runElection(FLETest.java:347)
	at org.apache.zookeeper.test.FLETest.testSingleElection(FLETest.java:258)
	at org.apache.zookeeper.JUnit4ZKTestRunner$LoggedInvokeMethod.evaluate(JUnit4ZKTestRunner.java:52)


REGRESSION:  org.apache.zookeeper.test.FLETest.testDoubleElection

Error Message:
Fewer than a a majority has joined

Stack Trace:
junit.framework.AssertionFailedError: Fewer than a a majority has joined
	at org.apache.zookeeper.test.FLETest.runElection(FLETest.java:347)
	at org.apache.zookeeper.test.FLETest.testDoubleElection(FLETest.java:268)
	at org.apache.zookeeper.JUnit4ZKTestRunner$LoggedInvokeMethod.evaluate(JUnit4ZKTestRunner.java:52)


REGRESSION:  org.apache.zookeeper.test.FLETest.testTripleElection

Error Message:
Fewer than a a majority has joined

Stack Trace:
junit.framework.AssertionFailedError: Fewer than a a majority has joined
	at org.apache.zookeeper.test.FLETest.runElection(FLETest.java:347)
	at org.apache.zookeeper.test.FLETest.testTripleElection(FLETest.java:277)
	at org.apache.zookeeper.JUnit4ZKTestRunner$LoggedInvokeMethod.evaluate(JUnit4ZKTestRunner.java:52)


REGRESSION:  org.apache.zookeeper.test.FLETest.testJoin

Error Message:
Incorrect LEADING state for peer 2

Stack Trace:
junit.framework.AssertionFailedError: Incorrect LEADING state for peer 2
	at org.apache.zookeeper.test.FLETest.testJoin(FLETest.java:438)
	at org.apache.zookeeper.JUnit4ZKTestRunner$LoggedInvokeMethod.evaluate(JUnit4ZKTestRunner.java:52)


REGRESSION:  org.apache.zookeeper.test.FLEZeroWeightTest.testZeroWeightQuorum

Error Message:
Threads didn't join

Stack Trace:
junit.framework.AssertionFailedError: Threads didn't join
	at org.apache.zookeeper.test.FLEZeroWeightTest.testZeroWeightQuorum(FLEZeroWeightTest.java:168)
	at org.apache.zookeeper.JUnit4ZKTestRunner$LoggedInvokeMethod.evaluate(JUnit4ZKTestRunner.java:52)


REGRESSION:  org.apache.zookeeper.test.LETest.testLE

Error Message:
Threads didn't join

Stack Trace:
junit.framework.AssertionFailedError: Threads didn't join
	at org.apache.zookeeper.test.LETest.testLE(LETest.java:123)
	at org.apache.zookeeper.JUnit4ZKTestRunner$LoggedInvokeMethod.evaluate(JUnit4ZKTestRunner.java:52)


REGRESSION:  org.apache.zookeeper.test.LoadFromLogTest.testRestoreWithTransactionErrors

Error Message:
KeeperErrorCode = ConnectionLoss for /invaliddir/test-

Stack Trace:
org.apache.zookeeper.KeeperException$ConnectionLossException: KeeperErrorCode = ConnectionLoss
for /invaliddir/test-
	at org.apache.zookeeper.KeeperException.create(KeeperException.java:99)
	at org.apache.zookeeper.KeeperException.create(KeeperException.java:51)
	at org.apache.zookeeper.ZooKeeper.create(ZooKeeper.java:778)
	at org.apache.zookeeper.test.LoadFromLogTest.testRestoreWithTransactionErrors(LoadFromLogTest.java:407)
	at org.apache.zookeeper.JUnit4ZKTestRunner$LoggedInvokeMethod.evaluate(JUnit4ZKTestRunner.java:52)




Mime
View raw message