zookeeper-dev mailing list archives

Site index · List index
Message view « Date » · « Thread »
Top « Date » · « Thread »
From Apache Jenkins Server <jenk...@builds.apache.org>
Subject ZooKeeper-trunk-jdk7 - Build # 152 - Failure
Date Sat, 21 Jan 2012 09:55:42 GMT
See https://builds.apache.org/job/ZooKeeper-trunk-jdk7/152/

###################################################################################
########################## LAST 60 LINES OF THE CONSOLE ###########################
[...truncated 144554 lines...]
    [junit] 2012-01-21 09:52:19,650 [myid:] - INFO  [main:ClientBase@417] - STOPPING server
    [junit] 2012-01-21 09:52:19,650 [myid:] - INFO  [NIOServerCxn.Factory:0.0.0.0/0.0.0.0:11221:NIOServerCnxnFactory@240]
- NIOServerCnxn factory exited run method
    [junit] 2012-01-21 09:52:19,650 [myid:] - INFO  [main:ZooKeeperServer@391] - shutting
down
    [junit] 2012-01-21 09:52:19,651 [myid:] - INFO  [main:SessionTrackerImpl@220] - Shutting
down
    [junit] 2012-01-21 09:52:19,651 [myid:] - INFO  [main:PrepRequestProcessor@711] - Shutting
down
    [junit] 2012-01-21 09:52:19,651 [myid:] - INFO  [main:SyncRequestProcessor@173] - Shutting
down
    [junit] 2012-01-21 09:52:19,651 [myid:] - INFO  [ProcessThread(sid:0 cport:-1)::PrepRequestProcessor@134]
- PrepRequestProcessor exited loop!
    [junit] 2012-01-21 09:52:19,651 [myid:] - INFO  [SyncThread:0:SyncRequestProcessor@155]
- SyncRequestProcessor exited!
    [junit] 2012-01-21 09:52:19,652 [myid:] - INFO  [main:FinalRequestProcessor@419] - shutdown
of request processor complete
    [junit] 2012-01-21 09:52:19,652 [myid:] - INFO  [main:FourLetterWordMain@43] - connecting
to 127.0.0.1 11221
    [junit] 2012-01-21 09:52:19,653 [myid:] - INFO  [main:JMXEnv@133] - ensureOnly:[]
    [junit] 2012-01-21 09:52:19,654 [myid:] - INFO  [main:ClientBase@410] - STARTING server
    [junit] 2012-01-21 09:52:19,654 [myid:] - INFO  [main:ZooKeeperServer@143] - Created server
with tickTime 3000 minSessionTimeout 6000 maxSessionTimeout 60000 datadir /home/jenkins/jenkins-slave/workspace/ZooKeeper-trunk-jdk7/trunk/build/test/tmp/test7130183464414931063.junit.dir/version-2
snapdir /home/jenkins/jenkins-slave/workspace/ZooKeeper-trunk-jdk7/trunk/build/test/tmp/test7130183464414931063.junit.dir/version-2
    [junit] 2012-01-21 09:52:19,654 [myid:] - INFO  [main:NIOServerCnxnFactory@110] - binding
to port 0.0.0.0/0.0.0.0:11221
    [junit] 2012-01-21 09:52:19,655 [myid:] - INFO  [main:FileSnap@83] - Reading snapshot
/home/jenkins/jenkins-slave/workspace/ZooKeeper-trunk-jdk7/trunk/build/test/tmp/test7130183464414931063.junit.dir/version-2/snapshot.b
    [junit] 2012-01-21 09:52:19,657 [myid:] - INFO  [main:FileTxnSnapLog@237] - Snapshotting:
b
    [junit] 2012-01-21 09:52:19,658 [myid:] - INFO  [main:FourLetterWordMain@43] - connecting
to 127.0.0.1 11221
    [junit] 2012-01-21 09:52:19,659 [myid:] - INFO  [NIOServerCxn.Factory:0.0.0.0/0.0.0.0:11221:NIOServerCnxnFactory@213]
- Accepted socket connection from /127.0.0.1:46856
    [junit] 2012-01-21 09:52:19,659 [myid:] - INFO  [NIOServerCxn.Factory:0.0.0.0/0.0.0.0:11221:NIOServerCnxn@820]
- Processing stat command from /127.0.0.1:46856
    [junit] 2012-01-21 09:52:19,659 [myid:] - INFO  [Thread-4:NIOServerCnxn$StatCommand@655]
- Stat command output
    [junit] 2012-01-21 09:52:19,660 [myid:] - INFO  [Thread-4:NIOServerCnxn@1000] - Closed
socket connection for client /127.0.0.1:46856 (no session established for client)
    [junit] 2012-01-21 09:52:19,660 [myid:] - INFO  [main:JMXEnv@133] - ensureOnly:[InMemoryDataTree,
StandaloneServer_port]
    [junit] 2012-01-21 09:52:19,661 [myid:] - INFO  [main:JMXEnv@105] - expect:InMemoryDataTree
    [junit] 2012-01-21 09:52:19,661 [myid:] - INFO  [main:JMXEnv@108] - found:InMemoryDataTree
org.apache.ZooKeeperService:name0=StandaloneServer_port-1,name1=InMemoryDataTree
    [junit] 2012-01-21 09:52:19,662 [myid:] - INFO  [main:JMXEnv@105] - expect:StandaloneServer_port
    [junit] 2012-01-21 09:52:19,662 [myid:] - INFO  [main:JMXEnv@108] - found:StandaloneServer_port
org.apache.ZooKeeperService:name0=StandaloneServer_port-1
    [junit] 2012-01-21 09:52:19,662 [myid:] - INFO  [main:JUnit4ZKTestRunner$LoggedInvokeMethod@57]
- FINISHED TEST METHOD testQuota
    [junit] 2012-01-21 09:52:19,662 [myid:] - INFO  [main:ClientBase@447] - tearDown starting
    [junit] 2012-01-21 09:52:19,737 [myid:] - INFO  [main:ZooKeeper@679] - Session: 0x134ffae4a380000
closed
    [junit] 2012-01-21 09:52:19,737 [myid:] - INFO  [main-EventThread:ClientCnxn$EventThread@511]
- EventThread shut down
    [junit] 2012-01-21 09:52:19,737 [myid:] - INFO  [main:ClientBase@417] - STOPPING server
    [junit] 2012-01-21 09:52:19,738 [myid:] - INFO  [NIOServerCxn.Factory:0.0.0.0/0.0.0.0:11221:NIOServerCnxnFactory@240]
- NIOServerCnxn factory exited run method
    [junit] 2012-01-21 09:52:19,738 [myid:] - INFO  [main:ZooKeeperServer@391] - shutting
down
    [junit] 2012-01-21 09:52:19,738 [myid:] - INFO  [main:SessionTrackerImpl@220] - Shutting
down
    [junit] 2012-01-21 09:52:19,738 [myid:] - INFO  [main:PrepRequestProcessor@711] - Shutting
down
    [junit] 2012-01-21 09:52:19,738 [myid:] - INFO  [main:SyncRequestProcessor@173] - Shutting
down
    [junit] 2012-01-21 09:52:19,738 [myid:] - INFO  [ProcessThread(sid:0 cport:-1)::PrepRequestProcessor@134]
- PrepRequestProcessor exited loop!
    [junit] 2012-01-21 09:52:19,739 [myid:] - INFO  [SyncThread:0:SyncRequestProcessor@155]
- SyncRequestProcessor exited!
    [junit] 2012-01-21 09:52:19,739 [myid:] - INFO  [main:FinalRequestProcessor@419] - shutdown
of request processor complete
    [junit] 2012-01-21 09:52:19,739 [myid:] - INFO  [main:FourLetterWordMain@43] - connecting
to 127.0.0.1 11221
    [junit] 2012-01-21 09:52:19,740 [myid:] - INFO  [main:JMXEnv@133] - ensureOnly:[]
    [junit] 2012-01-21 09:52:19,743 [myid:] - INFO  [main:ClientBase@475] - fdcount after
test is: 40 at start it was 28
    [junit] 2012-01-21 09:52:19,743 [myid:] - INFO  [main:ClientBase@477] - sleeping for 20
secs
    [junit] 2012-01-21 09:52:19,744 [myid:] - INFO  [main:ZKTestCase$1@61] - SUCCEEDED testQuota
    [junit] 2012-01-21 09:52:19,744 [myid:] - INFO  [main:ZKTestCase$1@56] - FINISHED testQuota
    [junit] Tests run: 1, Failures: 0, Errors: 0, Time elapsed: 0.481 sec

BUILD FAILED
/home/jenkins/jenkins-slave/workspace/ZooKeeper-trunk-jdk7/trunk/build.xml:1301: The following
error occurred while executing this line:
/home/jenkins/jenkins-slave/workspace/ZooKeeper-trunk-jdk7/trunk/build.xml:1212: Tests failed!

Total time: 18 minutes 48 seconds
Build step 'Execute shell' marked build as failure
[WARNINGS] Skipping publisher since build result is FAILURE
Archiving artifacts
Recording test results
Publishing Javadoc
Email was triggered for: Failure
Sending email for trigger: Failure



###################################################################################
############################## FAILED TESTS (if any) ##############################
6 tests failed.
REGRESSION:  org.apache.zookeeper.server.quorum.Zab1_0Test.testLeaderInElectingFollowers

Error Message:
Address already in use

Stack Trace:
java.net.BindException: Address already in use
	at java.net.PlainSocketImpl.socketBind(Native Method)
	at java.net.AbstractPlainSocketImpl.bind(AbstractPlainSocketImpl.java:374)
	at java.net.ServerSocket.bind(ServerSocket.java:376)
	at java.net.ServerSocket.<init>(ServerSocket.java:237)
	at java.net.ServerSocket.<init>(ServerSocket.java:128)
	at org.apache.zookeeper.server.quorum.Leader.<init>(Leader.java:134)
	at org.apache.zookeeper.server.quorum.Zab1_0Test.createLeader(Zab1_0Test.java:706)
	at org.apache.zookeeper.server.quorum.Zab1_0Test.testLeaderInElectingFollowers(Zab1_0Test.java:225)


REGRESSION:  org.apache.zookeeper.server.quorum.Zab1_0Test.testLastAcceptedEpoch

Error Message:
Address already in use

Stack Trace:
java.net.BindException: Address already in use
	at java.net.PlainSocketImpl.socketBind(Native Method)
	at java.net.AbstractPlainSocketImpl.bind(AbstractPlainSocketImpl.java:374)
	at java.net.ServerSocket.bind(ServerSocket.java:376)
	at java.net.ServerSocket.<init>(ServerSocket.java:237)
	at java.net.ServerSocket.<init>(ServerSocket.java:128)
	at org.apache.zookeeper.server.quorum.Leader.<init>(Leader.java:134)
	at org.apache.zookeeper.server.quorum.Zab1_0Test$MockLeader.<init>(Zab1_0Test.java:85)
	at org.apache.zookeeper.server.quorum.Zab1_0Test.createMockLeader(Zab1_0Test.java:712)
	at org.apache.zookeeper.server.quorum.Zab1_0Test.testLastAcceptedEpoch(Zab1_0Test.java:191)


REGRESSION:  org.apache.zookeeper.server.quorum.Zab1_0Test.testLeaderInConnectingFollowers

Error Message:
Address already in use

Stack Trace:
java.net.BindException: Address already in use
	at java.net.PlainSocketImpl.socketBind(Native Method)
	at java.net.AbstractPlainSocketImpl.bind(AbstractPlainSocketImpl.java:374)
	at java.net.ServerSocket.bind(ServerSocket.java:376)
	at java.net.ServerSocket.<init>(ServerSocket.java:237)
	at java.net.ServerSocket.<init>(ServerSocket.java:128)
	at org.apache.zookeeper.server.quorum.Leader.<init>(Leader.java:134)
	at org.apache.zookeeper.server.quorum.Zab1_0Test.createLeader(Zab1_0Test.java:706)
	at org.apache.zookeeper.server.quorum.Zab1_0Test.testLeaderInConnectingFollowers(Zab1_0Test.java:136)


REGRESSION:  org.apache.zookeeper.server.quorum.Zab1_0Test.testNormalRun

Error Message:
Address already in use

Stack Trace:
java.net.BindException: Address already in use
	at java.net.PlainSocketImpl.socketBind(Native Method)
	at java.net.AbstractPlainSocketImpl.bind(AbstractPlainSocketImpl.java:374)
	at java.net.ServerSocket.bind(ServerSocket.java:376)
	at java.net.ServerSocket.<init>(ServerSocket.java:237)
	at java.net.ServerSocket.<init>(ServerSocket.java:128)
	at org.apache.zookeeper.server.quorum.Leader.<init>(Leader.java:134)
	at org.apache.zookeeper.server.quorum.Zab1_0Test.createLeader(Zab1_0Test.java:706)
	at org.apache.zookeeper.server.quorum.Zab1_0Test.testLeaderConversation(Zab1_0Test.java:320)
	at org.apache.zookeeper.server.quorum.Zab1_0Test.testNormalRun(Zab1_0Test.java:553)


REGRESSION:  org.apache.zookeeper.server.quorum.Zab1_0Test.testLeaderBehind

Error Message:
Address already in use

Stack Trace:
java.net.BindException: Address already in use
	at java.net.PlainSocketImpl.socketBind(Native Method)
	at java.net.AbstractPlainSocketImpl.bind(AbstractPlainSocketImpl.java:374)
	at java.net.ServerSocket.bind(ServerSocket.java:376)
	at java.net.ServerSocket.<init>(ServerSocket.java:237)
	at java.net.ServerSocket.<init>(ServerSocket.java:128)
	at org.apache.zookeeper.server.quorum.Leader.<init>(Leader.java:134)
	at org.apache.zookeeper.server.quorum.Zab1_0Test.createLeader(Zab1_0Test.java:706)
	at org.apache.zookeeper.server.quorum.Zab1_0Test.testLeaderConversation(Zab1_0Test.java:320)
	at org.apache.zookeeper.server.quorum.Zab1_0Test.testLeaderBehind(Zab1_0Test.java:617)


REGRESSION:  org.apache.zookeeper.server.quorum.Zab1_0Test.testAbandonBeforeACKEpoch

Error Message:
Address already in use

Stack Trace:
java.net.BindException: Address already in use
	at java.net.PlainSocketImpl.socketBind(Native Method)
	at java.net.AbstractPlainSocketImpl.bind(AbstractPlainSocketImpl.java:374)
	at java.net.ServerSocket.bind(ServerSocket.java:376)
	at java.net.ServerSocket.<init>(ServerSocket.java:237)
	at java.net.ServerSocket.<init>(ServerSocket.java:128)
	at org.apache.zookeeper.server.quorum.Leader.<init>(Leader.java:134)
	at org.apache.zookeeper.server.quorum.Zab1_0Test.createLeader(Zab1_0Test.java:706)
	at org.apache.zookeeper.server.quorum.Zab1_0Test.testLeaderConversation(Zab1_0Test.java:320)
	at org.apache.zookeeper.server.quorum.Zab1_0Test.testAbandonBeforeACKEpoch(Zab1_0Test.java:668)




Mime
View raw message