zookeeper-dev mailing list archives

Site index · List index
Message view « Date » · « Thread »
Top « Date » · « Thread »
From Apache Jenkins Server <jenk...@builds.apache.org>
Subject ZooKeeper-trunk - Build # 1396 - Failure
Date Wed, 14 Dec 2011 10:55:00 GMT
See https://builds.apache.org/job/ZooKeeper-trunk/1396/

###################################################################################
########################## LAST 60 LINES OF THE CONSOLE ###########################
[...truncated 127101 lines...]
    [junit] 2011-12-14 10:53:07,566 [myid:] - INFO  [main:PrepRequestProcessor@711] - Shutting
down
    [junit] 2011-12-14 10:53:07,567 [myid:] - INFO  [main:SyncRequestProcessor@173] - Shutting
down
    [junit] 2011-12-14 10:53:07,567 [myid:] - INFO  [ProcessThread(sid:0 cport:-1)::PrepRequestProcessor@134]
- PrepRequestProcessor exited loop!
    [junit] 2011-12-14 10:53:07,567 [myid:] - INFO  [SyncThread:0:SyncRequestProcessor@155]
- SyncRequestProcessor exited!
    [junit] 2011-12-14 10:53:07,567 [myid:] - INFO  [main:FinalRequestProcessor@419] - shutdown
of request processor complete
    [junit] 2011-12-14 10:53:07,568 [myid:] - INFO  [main:ClientBase@227] - connecting to
127.0.0.1 11221
    [junit] 2011-12-14 10:53:07,568 [myid:] - INFO  [main:JMXEnv@133] - ensureOnly:[]
    [junit] 2011-12-14 10:53:07,569 [myid:] - INFO  [main:ClientBase@428] - STARTING server
    [junit] 2011-12-14 10:53:07,570 [myid:] - INFO  [main:ZooKeeperServer@143] - Created server
with tickTime 3000 minSessionTimeout 6000 maxSessionTimeout 60000 datadir /home/jenkins/jenkins-slave/workspace/ZooKeeper-trunk/trunk/build/test/tmp/test7987150800259834365.junit.dir/version-2
snapdir /home/jenkins/jenkins-slave/workspace/ZooKeeper-trunk/trunk/build/test/tmp/test7987150800259834365.junit.dir/version-2
    [junit] 2011-12-14 10:53:07,570 [myid:] - INFO  [main:NIOServerCnxnFactory@110] - binding
to port 0.0.0.0/0.0.0.0:11221
    [junit] 2011-12-14 10:53:07,571 [myid:] - INFO  [main:FileSnap@83] - Reading snapshot
/home/jenkins/jenkins-slave/workspace/ZooKeeper-trunk/trunk/build/test/tmp/test7987150800259834365.junit.dir/version-2/snapshot.b
    [junit] 2011-12-14 10:53:07,573 [myid:] - INFO  [main:FileTxnSnapLog@236] - Snapshotting:
b
    [junit] 2011-12-14 10:53:07,575 [myid:] - INFO  [main:ClientBase@227] - connecting to
127.0.0.1 11221
    [junit] 2011-12-14 10:53:07,575 [myid:] - INFO  [NIOServerCxn.Factory:0.0.0.0/0.0.0.0:11221:NIOServerCnxnFactory@213]
- Accepted socket connection from /127.0.0.1:50553
    [junit] 2011-12-14 10:53:07,576 [myid:] - INFO  [NIOServerCxn.Factory:0.0.0.0/0.0.0.0:11221:NIOServerCnxn@820]
- Processing stat command from /127.0.0.1:50553
    [junit] 2011-12-14 10:53:07,576 [myid:] - INFO  [Thread-5:NIOServerCnxn$StatCommand@655]
- Stat command output
    [junit] 2011-12-14 10:53:07,576 [myid:] - INFO  [Thread-5:NIOServerCnxn@1000] - Closed
socket connection for client /127.0.0.1:50553 (no session established for client)
    [junit] 2011-12-14 10:53:07,577 [myid:] - INFO  [main:JMXEnv@133] - ensureOnly:[InMemoryDataTree,
StandaloneServer_port]
    [junit] 2011-12-14 10:53:07,578 [myid:] - INFO  [main:JMXEnv@105] - expect:InMemoryDataTree
    [junit] 2011-12-14 10:53:07,578 [myid:] - INFO  [main:JMXEnv@108] - found:InMemoryDataTree
org.apache.ZooKeeperService:name0=StandaloneServer_port-1,name1=InMemoryDataTree
    [junit] 2011-12-14 10:53:07,578 [myid:] - INFO  [main:JMXEnv@105] - expect:StandaloneServer_port
    [junit] 2011-12-14 10:53:07,578 [myid:] - INFO  [main:JMXEnv@108] - found:StandaloneServer_port
org.apache.ZooKeeperService:name0=StandaloneServer_port-1
    [junit] 2011-12-14 10:53:07,579 [myid:] - INFO  [main:JUnit4ZKTestRunner$LoggedInvokeMethod@57]
- FINISHED TEST METHOD testQuota
    [junit] 2011-12-14 10:53:07,579 [myid:] - INFO  [main:ClientBase@465] - tearDown starting
    [junit] 2011-12-14 10:53:07,651 [myid:] - INFO  [main:ZooKeeper@679] - Session: 0x1343c344baa0000
closed
    [junit] 2011-12-14 10:53:07,651 [myid:] - INFO  [main-EventThread:ClientCnxn$EventThread@511]
- EventThread shut down
    [junit] 2011-12-14 10:53:07,651 [myid:] - INFO  [main:ClientBase@435] - STOPPING server
    [junit] 2011-12-14 10:53:07,651 [myid:] - INFO  [NIOServerCxn.Factory:0.0.0.0/0.0.0.0:11221:NIOServerCnxnFactory@240]
- NIOServerCnxn factory exited run method
    [junit] 2011-12-14 10:53:07,652 [myid:] - INFO  [main:ZooKeeperServer@391] - shutting
down
    [junit] 2011-12-14 10:53:07,652 [myid:] - INFO  [main:SessionTrackerImpl@220] - Shutting
down
    [junit] 2011-12-14 10:53:07,652 [myid:] - INFO  [main:PrepRequestProcessor@711] - Shutting
down
    [junit] 2011-12-14 10:53:07,652 [myid:] - INFO  [main:SyncRequestProcessor@173] - Shutting
down
    [junit] 2011-12-14 10:53:07,652 [myid:] - INFO  [ProcessThread(sid:0 cport:-1)::PrepRequestProcessor@134]
- PrepRequestProcessor exited loop!
    [junit] 2011-12-14 10:53:07,652 [myid:] - INFO  [SyncThread:0:SyncRequestProcessor@155]
- SyncRequestProcessor exited!
    [junit] 2011-12-14 10:53:07,653 [myid:] - INFO  [main:FinalRequestProcessor@419] - shutdown
of request processor complete
    [junit] 2011-12-14 10:53:07,653 [myid:] - INFO  [main:ClientBase@227] - connecting to
127.0.0.1 11221
    [junit] 2011-12-14 10:53:07,654 [myid:] - INFO  [main:JMXEnv@133] - ensureOnly:[]
    [junit] 2011-12-14 10:53:07,657 [myid:] - INFO  [main:ClientBase@493] - fdcount after
test is: 38 at start it was 27
    [junit] 2011-12-14 10:53:07,657 [myid:] - INFO  [main:ClientBase@495] - sleeping for 20
secs
    [junit] 2011-12-14 10:53:07,658 [myid:] - INFO  [main:ZKTestCase$1@61] - SUCCEEDED testQuota
    [junit] 2011-12-14 10:53:07,658 [myid:] - INFO  [main:ZKTestCase$1@56] - FINISHED testQuota
    [junit] Tests run: 1, Failures: 0, Errors: 0, Time elapsed: 0.589 sec

BUILD FAILED
/home/jenkins/jenkins-slave/workspace/ZooKeeper-trunk/trunk/build.xml:1301: The following
error occurred while executing this line:
/home/jenkins/jenkins-slave/workspace/ZooKeeper-trunk/trunk/build.xml:1212: Tests failed!

Total time: 20 minutes 41 seconds
Build step 'Execute shell' marked build as failure
[FINDBUGS] Skipping publisher since build result is FAILURE
[WARNINGS] Skipping publisher since build result is FAILURE
Archiving artifacts
Recording fingerprints
Recording test results
Publishing Javadoc
Publishing Clover coverage report...
No Clover report will be published due to a Build Failure
Email was triggered for: Failure
Sending email for trigger: Failure



###################################################################################
############################## FAILED TESTS (if any) ##############################
1 tests failed.
REGRESSION:  org.apache.zookeeper.test.QuorumZxidSyncTest.testBehindLeader

Error Message:
Servers didn't come up

Stack Trace:
junit.framework.AssertionFailedError: Servers didn't come up
	at org.apache.zookeeper.test.QuorumZxidSyncTest.testBehindLeader(QuorumZxidSyncTest.java:87)
	at org.apache.zookeeper.JUnit4ZKTestRunner$LoggedInvokeMethod.evaluate(JUnit4ZKTestRunner.java:52)




Mime
View raw message