zookeeper-dev mailing list archives

Site index · List index
Message view « Date » · « Thread »
Top « Date » · « Thread »
From Apache Jenkins Server <jenk...@builds.apache.org>
Subject ZooKeeper-trunk-jdk7 - Build # 110 - Failure
Date Fri, 09 Dec 2011 09:57:46 GMT
See https://builds.apache.org/job/ZooKeeper-trunk-jdk7/110/

###################################################################################
########################## LAST 60 LINES OF THE CONSOLE ###########################
[...truncated 135483 lines...]
    [junit] 2011-12-09 09:53:47,038 [myid:] - INFO  [main:ClientBase@435] - STOPPING server
    [junit] 2011-12-09 09:53:47,038 [myid:] - INFO  [NIOServerCxn.Factory:0.0.0.0/0.0.0.0:11221:NIOServerCnxnFactory@240]
- NIOServerCnxn factory exited run method
    [junit] 2011-12-09 09:53:47,038 [myid:] - INFO  [main:ZooKeeperServer@391] - shutting
down
    [junit] 2011-12-09 09:53:47,038 [myid:] - INFO  [main:SessionTrackerImpl@220] - Shutting
down
    [junit] 2011-12-09 09:53:47,039 [myid:] - INFO  [main:PrepRequestProcessor@711] - Shutting
down
    [junit] 2011-12-09 09:53:47,039 [myid:] - INFO  [main:SyncRequestProcessor@173] - Shutting
down
    [junit] 2011-12-09 09:53:47,039 [myid:] - INFO  [ProcessThread(sid:0 cport:-1)::PrepRequestProcessor@134]
- PrepRequestProcessor exited loop!
    [junit] 2011-12-09 09:53:47,039 [myid:] - INFO  [SyncThread:0:SyncRequestProcessor@155]
- SyncRequestProcessor exited!
    [junit] 2011-12-09 09:53:47,039 [myid:] - INFO  [main:FinalRequestProcessor@419] - shutdown
of request processor complete
    [junit] 2011-12-09 09:53:47,040 [myid:] - INFO  [main:ClientBase@227] - connecting to
127.0.0.1 11221
    [junit] 2011-12-09 09:53:47,040 [myid:] - INFO  [main:JMXEnv@133] - ensureOnly:[]
    [junit] 2011-12-09 09:53:47,041 [myid:] - INFO  [main:ClientBase@428] - STARTING server
    [junit] 2011-12-09 09:53:47,041 [myid:] - INFO  [main:ZooKeeperServer@143] - Created server
with tickTime 3000 minSessionTimeout 6000 maxSessionTimeout 60000 datadir /home/jenkins/jenkins-slave/workspace/ZooKeeper-trunk-jdk7/trunk/build/test/tmp/test267223458099157891.junit.dir/version-2
snapdir /home/jenkins/jenkins-slave/workspace/ZooKeeper-trunk-jdk7/trunk/build/test/tmp/test267223458099157891.junit.dir/version-2
    [junit] 2011-12-09 09:53:47,042 [myid:] - INFO  [main:NIOServerCnxnFactory@110] - binding
to port 0.0.0.0/0.0.0.0:11221
    [junit] 2011-12-09 09:53:47,042 [myid:] - INFO  [main:FileSnap@83] - Reading snapshot
/home/jenkins/jenkins-slave/workspace/ZooKeeper-trunk-jdk7/trunk/build/test/tmp/test267223458099157891.junit.dir/version-2/snapshot.b
    [junit] 2011-12-09 09:53:47,044 [myid:] - INFO  [main:FileTxnSnapLog@255] - Snapshotting:
b
    [junit] 2011-12-09 09:53:47,046 [myid:] - INFO  [main:ClientBase@227] - connecting to
127.0.0.1 11221
    [junit] 2011-12-09 09:53:47,046 [myid:] - INFO  [NIOServerCxn.Factory:0.0.0.0/0.0.0.0:11221:NIOServerCnxnFactory@213]
- Accepted socket connection from /127.0.0.1:55899
    [junit] 2011-12-09 09:53:47,047 [myid:] - INFO  [NIOServerCxn.Factory:0.0.0.0/0.0.0.0:11221:NIOServerCnxn@820]
- Processing stat command from /127.0.0.1:55899
    [junit] 2011-12-09 09:53:47,047 [myid:] - INFO  [Thread-4:NIOServerCnxn$StatCommand@655]
- Stat command output
    [junit] 2011-12-09 09:53:47,047 [myid:] - INFO  [Thread-4:NIOServerCnxn@1000] - Closed
socket connection for client /127.0.0.1:55899 (no session established for client)
    [junit] 2011-12-09 09:53:47,047 [myid:] - INFO  [main:JMXEnv@133] - ensureOnly:[InMemoryDataTree,
StandaloneServer_port]
    [junit] 2011-12-09 09:53:47,049 [myid:] - INFO  [main:JMXEnv@105] - expect:InMemoryDataTree
    [junit] 2011-12-09 09:53:47,049 [myid:] - INFO  [main:JMXEnv@108] - found:InMemoryDataTree
org.apache.ZooKeeperService:name0=StandaloneServer_port-1,name1=InMemoryDataTree
    [junit] 2011-12-09 09:53:47,049 [myid:] - INFO  [main:JMXEnv@105] - expect:StandaloneServer_port
    [junit] 2011-12-09 09:53:47,049 [myid:] - INFO  [main:JMXEnv@108] - found:StandaloneServer_port
org.apache.ZooKeeperService:name0=StandaloneServer_port-1
    [junit] 2011-12-09 09:53:47,050 [myid:] - INFO  [main:JUnit4ZKTestRunner$LoggedInvokeMethod@57]
- FINISHED TEST METHOD testQuota
    [junit] 2011-12-09 09:53:47,050 [myid:] - INFO  [main:ClientBase@465] - tearDown starting
    [junit] 2011-12-09 09:53:47,126 [myid:] - INFO  [main:ZooKeeper@679] - Session: 0x134223e2b8d0000
closed
    [junit] 2011-12-09 09:53:47,126 [myid:] - INFO  [main-EventThread:ClientCnxn$EventThread@511]
- EventThread shut down
    [junit] 2011-12-09 09:53:47,126 [myid:] - INFO  [main:ClientBase@435] - STOPPING server
    [junit] 2011-12-09 09:53:47,126 [myid:] - INFO  [NIOServerCxn.Factory:0.0.0.0/0.0.0.0:11221:NIOServerCnxnFactory@240]
- NIOServerCnxn factory exited run method
    [junit] 2011-12-09 09:53:47,126 [myid:] - INFO  [main:ZooKeeperServer@391] - shutting
down
    [junit] 2011-12-09 09:53:47,127 [myid:] - INFO  [main:SessionTrackerImpl@220] - Shutting
down
    [junit] 2011-12-09 09:53:47,127 [myid:] - INFO  [main:PrepRequestProcessor@711] - Shutting
down
    [junit] 2011-12-09 09:53:47,127 [myid:] - INFO  [main:SyncRequestProcessor@173] - Shutting
down
    [junit] 2011-12-09 09:53:47,127 [myid:] - INFO  [ProcessThread(sid:0 cport:-1)::PrepRequestProcessor@134]
- PrepRequestProcessor exited loop!
    [junit] 2011-12-09 09:53:47,127 [myid:] - INFO  [SyncThread:0:SyncRequestProcessor@155]
- SyncRequestProcessor exited!
    [junit] 2011-12-09 09:53:47,127 [myid:] - INFO  [main:FinalRequestProcessor@419] - shutdown
of request processor complete
    [junit] 2011-12-09 09:53:47,128 [myid:] - INFO  [main:ClientBase@227] - connecting to
127.0.0.1 11221
    [junit] 2011-12-09 09:53:47,128 [myid:] - INFO  [main:JMXEnv@133] - ensureOnly:[]
    [junit] 2011-12-09 09:53:47,131 [myid:] - INFO  [main:ClientBase@493] - fdcount after
test is: 40 at start it was 28
    [junit] 2011-12-09 09:53:47,131 [myid:] - INFO  [main:ClientBase@495] - sleeping for 20
secs
    [junit] 2011-12-09 09:53:47,132 [myid:] - INFO  [main:ZKTestCase$1@61] - SUCCEEDED testQuota
    [junit] 2011-12-09 09:53:47,132 [myid:] - INFO  [main:ZKTestCase$1@56] - FINISHED testQuota
    [junit] Tests run: 1, Failures: 0, Errors: 0, Time elapsed: 0.503 sec

BUILD FAILED
/home/jenkins/jenkins-slave/workspace/ZooKeeper-trunk-jdk7/trunk/build.xml:1301: The following
error occurred while executing this line:
/home/jenkins/jenkins-slave/workspace/ZooKeeper-trunk-jdk7/trunk/build.xml:1212: Tests failed!

Total time: 19 minutes 53 seconds
Build step 'Execute shell' marked build as failure
[WARNINGS] Skipping publisher since build result is FAILURE
Archiving artifacts
Recording test results
Publishing Javadoc
Email was triggered for: Failure
Sending email for trigger: Failure



###################################################################################
############################## FAILED TESTS (if any) ##############################
1 tests failed.
REGRESSION:  org.apache.zookeeper.test.LETest.testLE

Error Message:
Threads didn't join

Stack Trace:
junit.framework.AssertionFailedError: Threads didn't join
	at org.apache.zookeeper.test.LETest.testLE(LETest.java:123)
	at org.apache.zookeeper.JUnit4ZKTestRunner$LoggedInvokeMethod.evaluate(JUnit4ZKTestRunner.java:52)




Mime
View raw message