zookeeper-dev mailing list archives

Site index · List index
Message view « Date » · « Thread »
Top « Date » · « Thread »
From Apache Jenkins Server <jenk...@builds.apache.org>
Subject ZooKeeper-trunk - Build # 1321 - Failure
Date Sun, 02 Oct 2011 11:48:02 GMT
See https://builds.apache.org/job/ZooKeeper-trunk/1321/

###################################################################################
########################## LAST 60 LINES OF THE CONSOLE ###########################
[...truncated 146974 lines...]
    [junit] 2011-10-02 11:46:34,215 [myid:] - INFO  [main:PrepRequestProcessor@715] - Shutting
down
    [junit] 2011-10-02 11:46:34,215 [myid:] - INFO  [main:SyncRequestProcessor@173] - Shutting
down
    [junit] 2011-10-02 11:46:34,215 [myid:] - INFO  [ProcessThread(sid:0 cport:-1)::PrepRequestProcessor@134]
- PrepRequestProcessor exited loop!
    [junit] 2011-10-02 11:46:34,215 [myid:] - INFO  [SyncThread:0:SyncRequestProcessor@155]
- SyncRequestProcessor exited!
    [junit] 2011-10-02 11:46:34,216 [myid:] - INFO  [main:FinalRequestProcessor@421] - shutdown
of request processor complete
    [junit] 2011-10-02 11:46:34,216 [myid:] - INFO  [main:ClientBase@227] - connecting to
127.0.0.1 11221
    [junit] 2011-10-02 11:46:34,217 [myid:] - INFO  [main:JMXEnv@133] - ensureOnly:[]
    [junit] 2011-10-02 11:46:34,218 [myid:] - INFO  [main:ClientBase@428] - STARTING server
    [junit] 2011-10-02 11:46:34,218 [myid:] - INFO  [main:ZooKeeperServer@158] - Created server
with tickTime 3000 minSessionTimeout 6000 maxSessionTimeout 60000 datadir /home/jenkins/jenkins-slave/workspace/ZooKeeper-trunk/trunk/build/test/tmp/test5368683959075577455.junit.dir/version-2
snapdir /home/jenkins/jenkins-slave/workspace/ZooKeeper-trunk/trunk/build/test/tmp/test5368683959075577455.junit.dir/version-2
    [junit] 2011-10-02 11:46:34,219 [myid:] - INFO  [main:NIOServerCnxnFactory@110] - binding
to port 0.0.0.0/0.0.0.0:11221
    [junit] 2011-10-02 11:46:34,219 [myid:] - INFO  [main:FileSnap@83] - Reading snapshot
/home/jenkins/jenkins-slave/workspace/ZooKeeper-trunk/trunk/build/test/tmp/test5368683959075577455.junit.dir/version-2/snapshot.b
    [junit] 2011-10-02 11:46:34,222 [myid:] - INFO  [main:FileTxnSnapLog@255] - Snapshotting:
b
    [junit] 2011-10-02 11:46:34,224 [myid:] - INFO  [main:ClientBase@227] - connecting to
127.0.0.1 11221
    [junit] 2011-10-02 11:46:34,224 [myid:] - INFO  [NIOServerCxn.Factory:0.0.0.0/0.0.0.0:11221:NIOServerCnxnFactory@213]
- Accepted socket connection from /127.0.0.1:42243
    [junit] 2011-10-02 11:46:34,225 [myid:] - INFO  [NIOServerCxn.Factory:0.0.0.0/0.0.0.0:11221:NIOServerCnxn@820]
- Processing stat command from /127.0.0.1:42243
    [junit] 2011-10-02 11:46:34,225 [myid:] - INFO  [Thread-5:NIOServerCnxn$StatCommand@655]
- Stat command output
    [junit] 2011-10-02 11:46:34,225 [myid:] - INFO  [Thread-5:NIOServerCnxn@1000] - Closed
socket connection for client /127.0.0.1:42243 (no session established for client)
    [junit] 2011-10-02 11:46:34,225 [myid:] - INFO  [main:JMXEnv@133] - ensureOnly:[InMemoryDataTree,
StandaloneServer_port]
    [junit] 2011-10-02 11:46:34,227 [myid:] - INFO  [main:JMXEnv@105] - expect:InMemoryDataTree
    [junit] 2011-10-02 11:46:34,227 [myid:] - INFO  [main:JMXEnv@108] - found:InMemoryDataTree
org.apache.ZooKeeperService:name0=StandaloneServer_port-1,name1=InMemoryDataTree
    [junit] 2011-10-02 11:46:34,227 [myid:] - INFO  [main:JMXEnv@105] - expect:StandaloneServer_port
    [junit] 2011-10-02 11:46:34,227 [myid:] - INFO  [main:JMXEnv@108] - found:StandaloneServer_port
org.apache.ZooKeeperService:name0=StandaloneServer_port-1
    [junit] 2011-10-02 11:46:34,228 [myid:] - INFO  [main:JUnit4ZKTestRunner$LoggedInvokeMethod@57]
- FINISHED TEST METHOD testQuota
    [junit] 2011-10-02 11:46:34,228 [myid:] - INFO  [main:ClientBase@465] - tearDown starting
    [junit] 2011-10-02 11:46:34,299 [myid:] - INFO  [main:ZooKeeper@679] - Session: 0x132c474fdcb0000
closed
    [junit] 2011-10-02 11:46:34,299 [myid:] - INFO  [main-EventThread:ClientCnxn$EventThread@511]
- EventThread shut down
    [junit] 2011-10-02 11:46:34,300 [myid:] - INFO  [main:ClientBase@435] - STOPPING server
    [junit] 2011-10-02 11:46:34,300 [myid:] - INFO  [NIOServerCxn.Factory:0.0.0.0/0.0.0.0:11221:NIOServerCnxnFactory@240]
- NIOServerCnxn factory exited run method
    [junit] 2011-10-02 11:46:34,300 [myid:] - INFO  [main:ZooKeeperServer@410] - shutting
down
    [junit] 2011-10-02 11:46:34,300 [myid:] - INFO  [main:SessionTrackerImpl@206] - Shutting
down
    [junit] 2011-10-02 11:46:34,301 [myid:] - INFO  [main:PrepRequestProcessor@715] - Shutting
down
    [junit] 2011-10-02 11:46:34,301 [myid:] - INFO  [main:SyncRequestProcessor@173] - Shutting
down
    [junit] 2011-10-02 11:46:34,301 [myid:] - INFO  [ProcessThread(sid:0 cport:-1)::PrepRequestProcessor@134]
- PrepRequestProcessor exited loop!
    [junit] 2011-10-02 11:46:34,301 [myid:] - INFO  [SyncThread:0:SyncRequestProcessor@155]
- SyncRequestProcessor exited!
    [junit] 2011-10-02 11:46:34,301 [myid:] - INFO  [main:FinalRequestProcessor@421] - shutdown
of request processor complete
    [junit] 2011-10-02 11:46:34,302 [myid:] - INFO  [main:ClientBase@227] - connecting to
127.0.0.1 11221
    [junit] 2011-10-02 11:46:34,302 [myid:] - INFO  [main:JMXEnv@133] - ensureOnly:[]
    [junit] 2011-10-02 11:46:34,305 [myid:] - INFO  [main:ClientBase@493] - fdcount after
test is: 36 at start it was 25
    [junit] 2011-10-02 11:46:34,306 [myid:] - INFO  [main:ClientBase@495] - sleeping for 20
secs
    [junit] 2011-10-02 11:46:34,307 [myid:] - INFO  [main:ZKTestCase$1@60] - SUCCEEDED testQuota
    [junit] 2011-10-02 11:46:34,307 [myid:] - INFO  [main:ZKTestCase$1@55] - FINISHED testQuota
    [junit] Tests run: 1, Failures: 0, Errors: 0, Time elapsed: 0.507 sec

BUILD FAILED
/home/jenkins/jenkins-slave/workspace/ZooKeeper-trunk/trunk/build.xml:1207: The following
error occurred while executing this line:
/home/jenkins/jenkins-slave/workspace/ZooKeeper-trunk/trunk/build.xml:1118: Tests failed!

Total time: 16 minutes 57 seconds
Build step 'Execute shell' marked build as failure
[FINDBUGS] Skipping publisher since build result is FAILURE
[WARNINGS] Skipping publisher since build result is FAILURE
Archiving artifacts
Recording fingerprints
Recording test results
Publishing Javadoc
Publishing Clover coverage report...
No Clover report will be published due to a Build Failure
Email was triggered for: Failure
Sending email for trigger: Failure



###################################################################################
############################## FAILED TESTS (if any) ##############################
1 tests failed.
REGRESSION:  org.apache.zookeeper.test.QuorumTest.testLeaderShutdown

Error Message:
KeeperErrorCode = ConnectionLoss for /blah

Stack Trace:
org.apache.zookeeper.KeeperException$ConnectionLossException: KeeperErrorCode = ConnectionLoss
for /blah
	at org.apache.zookeeper.KeeperException.create(KeeperException.java:99)
	at org.apache.zookeeper.KeeperException.create(KeeperException.java:51)
	at org.apache.zookeeper.ZooKeeper.create(ZooKeeper.java:778)
	at org.apache.zookeeper.test.QuorumTest.testLeaderShutdown(QuorumTest.java:135)
	at org.apache.zookeeper.JUnit4ZKTestRunner$LoggedInvokeMethod.evaluate(JUnit4ZKTestRunner.java:52)




Mime
View raw message