zookeeper-dev mailing list archives

Site index · List index
Message view « Date » · « Thread »
Top « Date » · « Thread »
From Apache Jenkins Server <jenk...@builds.apache.org>
Subject ZooKeeper-trunk - Build # 1231 - Still Failing
Date Sat, 02 Jul 2011 15:56:33 GMT
See https://builds.apache.org/job/ZooKeeper-trunk/1231/

###################################################################################
########################## LAST 60 LINES OF THE CONSOLE ###########################
[...truncated 232962 lines...]
     [exec] libtool: link: ( cd ".libs" && rm -f "libzookeeper_mt.la" && ln
-s "../libzookeeper_mt.la" "libzookeeper_mt.la" )
     [exec] gcc -DHAVE_CONFIG_H -I. -I/grid/0/hudson/hudson-slave/workspace/ZooKeeper-trunk/trunk/src/c
 -I/grid/0/hudson/hudson-slave/workspace/ZooKeeper-trunk/trunk/src/c/include -I/grid/0/hudson/hudson-slave/workspace/ZooKeeper-trunk/trunk/src/c/tests
-I/grid/0/hudson/hudson-slave/workspace/ZooKeeper-trunk/trunk/src/c/generated  -Wall -Werror
 -g -O2 -D_GNU_SOURCE -MT cli.o -MD -MP -MF .deps/cli.Tpo -c -o cli.o `test -f 'src/cli.c'
|| echo '/grid/0/hudson/hudson-slave/workspace/ZooKeeper-trunk/trunk/src/c/'`src/cli.c
     [exec] mv -f .deps/cli.Tpo .deps/cli.Po
     [exec] /bin/bash ./libtool --tag=CC   --mode=link gcc -Wall -Werror  -g -O2 -D_GNU_SOURCE
  -o cli_st cli.o libzookeeper_st.la 
     [exec] libtool: link: gcc -Wall -Werror -g -O2 -D_GNU_SOURCE -o .libs/cli_st cli.o  ./.libs/libzookeeper_st.so
-lm -Wl,-rpath -Wl,/grid/0/hudson/hudson-slave/workspace/ZooKeeper-trunk/trunk/build/test/test-cppunit/lib
     [exec] gcc -DHAVE_CONFIG_H -I. -I/grid/0/hudson/hudson-slave/workspace/ZooKeeper-trunk/trunk/src/c
 -I/grid/0/hudson/hudson-slave/workspace/ZooKeeper-trunk/trunk/src/c/include -I/grid/0/hudson/hudson-slave/workspace/ZooKeeper-trunk/trunk/src/c/tests
-I/grid/0/hudson/hudson-slave/workspace/ZooKeeper-trunk/trunk/src/c/generated  -DTHREADED
-g -O2 -D_GNU_SOURCE -MT cli_mt-cli.o -MD -MP -MF .deps/cli_mt-cli.Tpo -c -o cli_mt-cli.o
`test -f 'src/cli.c' || echo '/grid/0/hudson/hudson-slave/workspace/ZooKeeper-trunk/trunk/src/c/'`src/cli.c
     [exec] mv -f .deps/cli_mt-cli.Tpo .deps/cli_mt-cli.Po
     [exec] /bin/bash ./libtool --tag=CC   --mode=link gcc -DTHREADED -g -O2 -D_GNU_SOURCE
  -o cli_mt cli_mt-cli.o libzookeeper_mt.la 
     [exec] libtool: link: gcc -DTHREADED -g -O2 -D_GNU_SOURCE -o .libs/cli_mt cli_mt-cli.o
 ./.libs/libzookeeper_mt.so -lm -lpthread -Wl,-rpath -Wl,/grid/0/hudson/hudson-slave/workspace/ZooKeeper-trunk/trunk/build/test/test-cppunit/lib
     [exec] gcc -DHAVE_CONFIG_H -I. -I/grid/0/hudson/hudson-slave/workspace/ZooKeeper-trunk/trunk/src/c
 -I/grid/0/hudson/hudson-slave/workspace/ZooKeeper-trunk/trunk/src/c/include -I/grid/0/hudson/hudson-slave/workspace/ZooKeeper-trunk/trunk/src/c/tests
-I/grid/0/hudson/hudson-slave/workspace/ZooKeeper-trunk/trunk/src/c/generated  -DTHREADED
-g -O2 -D_GNU_SOURCE -MT load_gen-load_gen.o -MD -MP -MF .deps/load_gen-load_gen.Tpo -c -o
load_gen-load_gen.o `test -f 'src/load_gen.c' || echo '/grid/0/hudson/hudson-slave/workspace/ZooKeeper-trunk/trunk/src/c/'`src/load_gen.c
     [exec] mv -f .deps/load_gen-load_gen.Tpo .deps/load_gen-load_gen.Po
     [exec] /bin/bash ./libtool --tag=CC   --mode=link gcc -DTHREADED -g -O2 -D_GNU_SOURCE
  -o load_gen load_gen-load_gen.o libzookeeper_mt.la 
     [exec] libtool: link: gcc -DTHREADED -g -O2 -D_GNU_SOURCE -o .libs/load_gen load_gen-load_gen.o
 ./.libs/libzookeeper_mt.so -lm -lpthread -Wl,-rpath -Wl,/grid/0/hudson/hudson-slave/workspace/ZooKeeper-trunk/trunk/build/test/test-cppunit/lib
     [exec] make  zktest-st zktest-mt
     [exec] make[1]: Entering directory `/grid/0/hudson/hudson-slave/workspace/ZooKeeper-trunk/trunk/build/test/test-cppunit'
     [exec] g++ -DHAVE_CONFIG_H -I. -I/grid/0/hudson/hudson-slave/workspace/ZooKeeper-trunk/trunk/src/c
 -I/grid/0/hudson/hudson-slave/workspace/ZooKeeper-trunk/trunk/src/c/include -I/grid/0/hudson/hudson-slave/workspace/ZooKeeper-trunk/trunk/src/c/tests
-I/grid/0/hudson/hudson-slave/workspace/ZooKeeper-trunk/trunk/src/c/generated  -DUSE_STATIC_LIB
-DZKSERVER_CMD="\"/grid/0/hudson/hudson-slave/workspace/ZooKeeper-trunk/trunk/src/c/tests/zkServer.sh\""
-DZOO_IPV6_ENABLED -g -O2 -MT zktest_st-TestDriver.o -MD -MP -MF .deps/zktest_st-TestDriver.Tpo
-c -o zktest_st-TestDriver.o `test -f 'tests/TestDriver.cc' || echo '/grid/0/hudson/hudson-slave/workspace/ZooKeeper-trunk/trunk/src/c/'`tests/TestDriver.cc
     [exec] mv -f .deps/zktest_st-TestDriver.Tpo .deps/zktest_st-TestDriver.Po
     [exec] g++ -DHAVE_CONFIG_H -I. -I/grid/0/hudson/hudson-slave/workspace/ZooKeeper-trunk/trunk/src/c
 -I/grid/0/hudson/hudson-slave/workspace/ZooKeeper-trunk/trunk/src/c/include -I/grid/0/hudson/hudson-slave/workspace/ZooKeeper-trunk/trunk/src/c/tests
-I/grid/0/hudson/hudson-slave/workspace/ZooKeeper-trunk/trunk/src/c/generated  -DUSE_STATIC_LIB
-DZKSERVER_CMD="\"/grid/0/hudson/hudson-slave/workspace/ZooKeeper-trunk/trunk/src/c/tests/zkServer.sh\""
-DZOO_IPV6_ENABLED -g -O2 -MT zktest_st-LibCMocks.o -MD -MP -MF .deps/zktest_st-LibCMocks.Tpo
-c -o zktest_st-LibCMocks.o `test -f 'tests/LibCMocks.cc' || echo '/grid/0/hudson/hudson-slave/workspace/ZooKeeper-trunk/trunk/src/c/'`tests/LibCMocks.cc
     [exec] mv -f .deps/zktest_st-LibCMocks.Tpo .deps/zktest_st-LibCMocks.Po
     [exec] g++ -DHAVE_CONFIG_H -I. -I/grid/0/hudson/hudson-slave/workspace/ZooKeeper-trunk/trunk/src/c
 -I/grid/0/hudson/hudson-slave/workspace/ZooKeeper-trunk/trunk/src/c/include -I/grid/0/hudson/hudson-slave/workspace/ZooKeeper-trunk/trunk/src/c/tests
-I/grid/0/hudson/hudson-slave/workspace/ZooKeeper-trunk/trunk/src/c/generated  -DUSE_STATIC_LIB
-DZKSERVER_CMD="\"/grid/0/hudson/hudson-slave/workspace/ZooKeeper-trunk/trunk/src/c/tests/zkServer.sh\""
-DZOO_IPV6_ENABLED -g -O2 -MT zktest_st-LibCSymTable.o -MD -MP -MF .deps/zktest_st-LibCSymTable.Tpo
-c -o zktest_st-LibCSymTable.o `test -f 'tests/LibCSymTable.cc' || echo '/grid/0/hudson/hudson-slave/workspace/ZooKeeper-trunk/trunk/src/c/'`tests/LibCSymTable.cc
     [exec] mv -f .deps/zktest_st-LibCSymTable.Tpo .deps/zktest_st-LibCSymTable.Po
     [exec] g++ -DHAVE_CONFIG_H -I. -I/grid/0/hudson/hudson-slave/workspace/ZooKeeper-trunk/trunk/src/c
 -I/grid/0/hudson/hudson-slave/workspace/ZooKeeper-trunk/trunk/src/c/include -I/grid/0/hudson/hudson-slave/workspace/ZooKeeper-trunk/trunk/src/c/tests
-I/grid/0/hudson/hudson-slave/workspace/ZooKeeper-trunk/trunk/src/c/generated  -DUSE_STATIC_LIB
-DZKSERVER_CMD="\"/grid/0/hudson/hudson-slave/workspace/ZooKeeper-trunk/trunk/src/c/tests/zkServer.sh\""
-DZOO_IPV6_ENABLED -g -O2 -MT zktest_st-MocksBase.o -MD -MP -MF .deps/zktest_st-MocksBase.Tpo
-c -o zktest_st-MocksBase.o `test -f 'tests/MocksBase.cc' || echo '/grid/0/hudson/hudson-slave/workspace/ZooKeeper-trunk/trunk/src/c/'`tests/MocksBase.cc
     [exec] mv -f .deps/zktest_st-MocksBase.Tpo .deps/zktest_st-MocksBase.Po
     [exec] g++ -DHAVE_CONFIG_H -I. -I/grid/0/hudson/hudson-slave/workspace/ZooKeeper-trunk/trunk/src/c
 -I/grid/0/hudson/hudson-slave/workspace/ZooKeeper-trunk/trunk/src/c/include -I/grid/0/hudson/hudson-slave/workspace/ZooKeeper-trunk/trunk/src/c/tests
-I/grid/0/hudson/hudson-slave/workspace/ZooKeeper-trunk/trunk/src/c/generated  -DUSE_STATIC_LIB
-DZKSERVER_CMD="\"/grid/0/hudson/hudson-slave/workspace/ZooKeeper-trunk/trunk/src/c/tests/zkServer.sh\""
-DZOO_IPV6_ENABLED -g -O2 -MT zktest_st-ZKMocks.o -MD -MP -MF .deps/zktest_st-ZKMocks.Tpo
-c -o zktest_st-ZKMocks.o `test -f 'tests/ZKMocks.cc' || echo '/grid/0/hudson/hudson-slave/workspace/ZooKeeper-trunk/trunk/src/c/'`tests/ZKMocks.cc
     [exec] mv -f .deps/zktest_st-ZKMocks.Tpo .deps/zktest_st-ZKMocks.Po
     [exec] g++ -DHAVE_CONFIG_H -I. -I/grid/0/hudson/hudson-slave/workspace/ZooKeeper-trunk/trunk/src/c
 -I/grid/0/hudson/hudson-slave/workspace/ZooKeeper-trunk/trunk/src/c/include -I/grid/0/hudson/hudson-slave/workspace/ZooKeeper-trunk/trunk/src/c/tests
-I/grid/0/hudson/hudson-slave/workspace/ZooKeeper-trunk/trunk/src/c/generated  -DUSE_STATIC_LIB
-DZKSERVER_CMD="\"/grid/0/hudson/hudson-slave/workspace/ZooKeeper-trunk/trunk/src/c/tests/zkServer.sh\""
-DZOO_IPV6_ENABLED -g -O2 -MT zktest_st-Util.o -MD -MP -MF .deps/zktest_st-Util.Tpo -c -o
zktest_st-Util.o `test -f 'tests/Util.cc' || echo '/grid/0/hudson/hudson-slave/workspace/ZooKeeper-trunk/trunk/src/c/'`tests/Util.cc
     [exec] mv -f .deps/zktest_st-Util.Tpo .deps/zktest_st-Util.Po
     [exec] g++ -DHAVE_CONFIG_H -I. -I/grid/0/hudson/hudson-slave/workspace/ZooKeeper-trunk/trunk/src/c
 -I/grid/0/hudson/hudson-slave/workspace/ZooKeeper-trunk/trunk/src/c/include -I/grid/0/hudson/hudson-slave/workspace/ZooKeeper-trunk/trunk/src/c/tests
-I/grid/0/hudson/hudson-slave/workspace/ZooKeeper-trunk/trunk/src/c/generated  -DUSE_STATIC_LIB
-DZKSERVER_CMD="\"/grid/0/hudson/hudson-slave/workspace/ZooKeeper-trunk/trunk/src/c/tests/zkServer.sh\""
-DZOO_IPV6_ENABLED -g -O2 -MT zktest_st-ThreadingUtil.o -MD -MP -MF .deps/zktest_st-ThreadingUtil.Tpo
-c -o zktest_st-ThreadingUtil.o `test -f 'tests/ThreadingUtil.cc' || echo '/grid/0/hudson/hudson-slave/workspace/ZooKeeper-trunk/trunk/src/c/'`tests/ThreadingUtil.cc
     [exec] mv -f .deps/zktest_st-ThreadingUtil.Tpo .deps/zktest_st-ThreadingUtil.Po
     [exec] g++ -DHAVE_CONFIG_H -I. -I/grid/0/hudson/hudson-slave/workspace/ZooKeeper-trunk/trunk/src/c
 -I/grid/0/hudson/hudson-slave/workspace/ZooKeeper-trunk/trunk/src/c/include -I/grid/0/hudson/hudson-slave/workspace/ZooKeeper-trunk/trunk/src/c/tests
-I/grid/0/hudson/hudson-slave/workspace/ZooKeeper-trunk/trunk/src/c/generated  -DUSE_STATIC_LIB
-DZKSERVER_CMD="\"/grid/0/hudson/hudson-slave/workspace/ZooKeeper-trunk/trunk/src/c/tests/zkServer.sh\""
-DZOO_IPV6_ENABLED -g -O2 -MT zktest_st-TestClientRetry.o -MD -MP -MF .deps/zktest_st-TestClientRetry.Tpo
-c -o zktest_st-TestClientRetry.o `test -f 'tests/TestClientRetry.cc' || echo '/grid/0/hudson/hudson-slave/workspace/ZooKeeper-trunk/trunk/src/c/'`tests/TestClientRetry.cc
     [exec] mv -f .deps/zktest_st-TestClientRetry.Tpo .deps/zktest_st-TestClientRetry.Po
     [exec] g++ -DHAVE_CONFIG_H -I. -I/grid/0/hudson/hudson-slave/workspace/ZooKeeper-trunk/trunk/src/c
 -I/grid/0/hudson/hudson-slave/workspace/ZooKeeper-trunk/trunk/src/c/include -I/grid/0/hudson/hudson-slave/workspace/ZooKeeper-trunk/trunk/src/c/tests
-I/grid/0/hudson/hudson-slave/workspace/ZooKeeper-trunk/trunk/src/c/generated  -DUSE_STATIC_LIB
-DZKSERVER_CMD="\"/grid/0/hudson/hudson-slave/workspace/ZooKeeper-trunk/trunk/src/c/tests/zkServer.sh\""
-DZOO_IPV6_ENABLED -g -O2 -MT zktest_st-TestOperations.o -MD -MP -MF .deps/zktest_st-TestOperations.Tpo
-c -o zktest_st-TestOperations.o `test -f 'tests/TestOperations.cc' || echo '/grid/0/hudson/hudson-slave/workspace/ZooKeeper-trunk/trunk/src/c/'`tests/TestOperations.cc
     [exec] mv -f .deps/zktest_st-TestOperations.Tpo .deps/zktest_st-TestOperations.Po
     [exec] g++ -DHAVE_CONFIG_H -I. -I/grid/0/hudson/hudson-slave/workspace/ZooKeeper-trunk/trunk/src/c
 -I/grid/0/hudson/hudson-slave/workspace/ZooKeeper-trunk/trunk/src/c/include -I/grid/0/hudson/hudson-slave/workspace/ZooKeeper-trunk/trunk/src/c/tests
-I/grid/0/hudson/hudson-slave/workspace/ZooKeeper-trunk/trunk/src/c/generated  -DUSE_STATIC_LIB
-DZKSERVER_CMD="\"/grid/0/hudson/hudson-slave/workspace/ZooKeeper-trunk/trunk/src/c/tests/zkServer.sh\""
-DZOO_IPV6_ENABLED -g -O2 -MT zktest_st-TestZookeeperInit.o -MD -MP -MF .deps/zktest_st-TestZookeeperInit.Tpo
-c -o zktest_st-TestZookeeperInit.o `test -f 'tests/TestZookeeperInit.cc' || echo '/grid/0/hudson/hudson-slave/workspace/ZooKeeper-trunk/trunk/src/c/'`tests/TestZookeeperInit.cc
     [exec] mv -f .deps/zktest_st-TestZookeeperInit.Tpo .deps/zktest_st-TestZookeeperInit.Po
     [exec] g++ -DHAVE_CONFIG_H -I. -I/grid/0/hudson/hudson-slave/workspace/ZooKeeper-trunk/trunk/src/c
 -I/grid/0/hudson/hudson-slave/workspace/ZooKeeper-trunk/trunk/src/c/include -I/grid/0/hudson/hudson-slave/workspace/ZooKeeper-trunk/trunk/src/c/tests
-I/grid/0/hudson/hudson-slave/workspace/ZooKeeper-trunk/trunk/src/c/generated  -DUSE_STATIC_LIB
-DZKSERVER_CMD="\"/grid/0/hudson/hudson-slave/workspace/ZooKeeper-trunk/trunk/src/c/tests/zkServer.sh\""
-DZOO_IPV6_ENABLED -g -O2 -MT zktest_st-TestZookeeperClose.o -MD -MP -MF .deps/zktest_st-TestZookeeperClose.Tpo
-c -o zktest_st-TestZookeeperClose.o `test -f 'tests/TestZookeeperClose.cc' || echo '/grid/0/hudson/hudson-slave/workspace/ZooKeeper-trunk/trunk/src/c/'`tests/TestZookeeperClose.cc
     [exec] mv -f .deps/zktest_st-TestZookeeperClose.Tpo .deps/zktest_st-TestZookeeperClose.Po
     [exec] g++ -DHAVE_CONFIG_H -I. -I/grid/0/hudson/hudson-slave/workspace/ZooKeeper-trunk/trunk/src/c
 -I/grid/0/hudson/hudson-slave/workspace/ZooKeeper-trunk/trunk/src/c/include -I/grid/0/hudson/hudson-slave/workspace/ZooKeeper-trunk/trunk/src/c/tests
-I/grid/0/hudson/hudson-slave/workspace/ZooKeeper-trunk/trunk/src/c/generated  -DUSE_STATIC_LIB
-DZKSERVER_CMD="\"/grid/0/hudson/hudson-slave/workspace/ZooKeeper-trunk/trunk/src/c/tests/zkServer.sh\""
-DZOO_IPV6_ENABLED -g -O2 -MT zktest_st-TestClient.o -MD -MP -MF .deps/zktest_st-TestClient.Tpo
-c -o zktest_st-TestClient.o `test -f 'tests/TestClient.cc' || echo '/grid/0/hudson/hudson-slave/workspace/ZooKeeper-trunk/trunk/src/c/'`tests/TestClient.cc
     [exec] mv -f .deps/zktest_st-TestClient.Tpo .deps/zktest_st-TestClient.Po
     [exec] make[1]: Leaving directory `/grid/0/hudson/hudson-slave/workspace/ZooKeeper-trunk/trunk/build/test/test-cppunit'
     [exec] make[1]: *** No rule to make target `tests/TestMulti.cc', needed by `zktest_st-TestMulti.o'.
 Stop.
     [exec] make: *** [check-am] Error 2

BUILD FAILED
/grid/0/hudson/hudson-slave/workspace/ZooKeeper-trunk/trunk/build.xml:959: The following error
occurred while executing this line:
/grid/0/hudson/hudson-slave/workspace/ZooKeeper-trunk/trunk/build.xml:918: The following error
occurred while executing this line:
/grid/0/hudson/hudson-slave/workspace/ZooKeeper-trunk/trunk/build.xml:929: exec returned:
2

Total time: 18 minutes 48 seconds
[FINDBUGS] Skipping publisher since build result is FAILURE
[WARNINGS] Skipping publisher since build result is FAILURE
Recording fingerprints
Archiving artifacts
Recording test results
Publishing Javadoc
Publishing Clover coverage report...
No Clover report will be published due to a Build Failure
Email was triggered for: Failure
Sending email for trigger: Failure



###################################################################################
############################## FAILED TESTS (if any) ##############################
All tests passed

Mime
View raw message